{"text_format":"1","workbook":"xlsx","n_sheets":8,"sheets":["Introduction","Input","Output","MatrixCalculator","Reject","EstimatorGraphs","Equations","ExampleData"],"not_rendered":{"charts":16,"images":29,"macros":1,"external_links":0,"defined_names":0,"comments":0,"pivot_tables":0},"unopened":[],"bounds":{"document_bytes":16777216,"sheet_cells":100000,"rows_first":2000,"rows_last":500,"rows_between":2000,"halvings":0,"cell_chars":16384,"cell_head_chars":4096},"cells_cut":0,"cells_raw":0,"read":"whole","date_system":"1900"}

{"sheet":"Introduction","index":0,"n_rows":0,"n_cols":0,"rows_kept":0,"cut":false,"hidden":false,"merged":[]}

{"sheet":"Input","index":1,"n_rows":65,"n_cols":52,"rows_kept":65,"cut":false,"hidden":false,"merged":[[3,5,3,7],[27,13,27,14],[25,13,25,14],[22,13,22,14],[23,13,23,14],[24,13,24,14],[3,10,3,11],[3,13,3,14]]}
[]
[null,null,null,null,null,null,null,null,null,null,null,null,null,null,null,null,null,null,null,null,null,null,null,0.66]
[null,null,null,null,null,null,null,null,null,null,null,null,null,null,null,null,null,null,null,null,null,null,null,0.95,null,null,null,null,null,null,null,306.28629380242535,null,null,null,null,null,null,null,null,{"$f":"L2*Input!$E$5/Input!$E$7","v":0},null,null,null,null,null,null,null,null,null,359,3.9653867625361935E-3]
["Input:  Well ID","X (Easting) \nno two identical","Y (Northing) \nno two identical","Z (Hydraulic Head)","K (L/T)","Summary of Output",null,null,"+/- on Head (L)","Confidence Level","Base:Height constraint\nLow           High",null,"max  base or height (L)","Total Discharges\nQ (L3/(LT)     Jtot(M/LT)                  ",null,null,null,null,null,null,null,null,null,0.99]
["18HD07",1520940.6969999999,658569.67599999998,774.75,2500,null,{"$f":"Output!O1","v":"Gradient"},{"$f":"Output!P1","v":"Direction"},0.01,0.66,0.2,8,1000000000,3659.003484244749,0.1240753796757792]
["18HD05(65)",1520575.0079999999,658783.62899999996,774.42,"n",{"$f":"Output!N2","v":"Avg"},{"$f":"Output!O2","v":1.6017035295263723E-3},{"$f":"Output!P2","v":184.6153305680111},"<--measured counterclockwise from x axis",null,null,null,null,"ft^3/d/ft","kg/m/yr"]
["MW108S",1520339.4029999999,659446.14,774.18,0.3,{"$f":"Output!N3","v":"StDev"},{"$f":"Output!O3","v":4.2073056682410736E-4},{"$f":"Output!P3","v":24.347584537358681}]
["HR6",1521303.632,658812.69999999995,775.51,"Speed (L/T)"]
["HR13",1521141.023,659121.22900000005,775.41,{"$f":"E5*G9*1/E7","v":12.246889559924602},{"$f":"Output!N5","v":"All Wells"},{"$f":"Output!O5","v":1.4696267471909523E-3},{"$f":"Output!P5","v":174.80992223838734}]
["HAS",1520635.4639999999,660188.35199999996,773.74]
["18HD06",1521122.1769999999,658700.78500000003,775.19]
["18HD08(47)",1520895.9110000001,659059.255,774.91]
["18HD09(62)",1520790.6189999999,659265.20900000003,774.89]
["HAH",1520810.2479999999,659454.58499999996,775.01]
["18HD03(57)",1521786.139,659709.43000000005,776.52]
["MW125S",1521609.98,659067.80200000003,776.01]
["MW133S",1522898.5730000001,659399.93700000003,777.43]
["MW132S",1522337.139,660004.37100000004,777.06]
[]
[]
[]
[]
[null,null,null,null,null,null,null,null,null,null,null,null,null,"Vector view"]
[null,null,null,null,null,null,null,null,null,null,null,null,null,"Time of travel (T)"]
[null,null,null,null,null,null,null,null,null,null,null,null,null,5]
[null,null,null,null,null,null,null,null,null,null,null,null,null,"Rotate Direction"]
[null,null,null,null,null,null,null,null,null,null,null,null,null,"Direction (o)","c-clockwise"]
[null,null,null,null,null,null,null,null,null,null,null,null,null,0]
[]
[]
[]
[]
[]
[]
[]
[]
[]
[]
[]
[]
[]
[]
[]
[]
[]
[]
[]
[]
[]
[]
["x","y","Conc.","Origin x","Origin y","Origin H","norm x","norm y","norm H","grad","q (L/T)","J (M/L^2T)","Seg L (L)","Units Conc","Mol. Wt."]
[1000,500,1,0,0,2539.8644433049435,0,0,2539.8644433049435,null,null,1.1152642619977995,null,true]
[1000,1500,null,0,1000,2539.7315006991616,-100,0,2539.7180831655737,-1.4636013936978997E-3,3.659003484244749,null,946.68474161148288,false]
[1000,1500,1,null,null,null,null,null,null,null,null,null,null,false]
[null,null,null,null,null,null,null,null,null,null,null,null,null,false]
[null,null,null,null,null,null,null,null,null,null,null,null,null,false]
[null,null,null,null,null,null,null,null,null,null,null,null,null,false]
[null,null,null,null,null,null,null,null,null,null,null,null,null,false]
[null,null,null,null,null,null,null,null,null,null,null,null,null,false]
[null,null,null,null,null,null,null,null,null,null,null,null,null,false]
[null,null,null,null,null,null,null,null,null,null,null,null,null,true]
[null,null,null,null,null,null,null,null,null,null,null,null,null,false]
[null,null,null,null,null,null,null,null,null,null,null,null,null,false]
[null,null,null,null,null,null,null,null,null,null,null,null,null,true]
[null,null,null,null,null,null,null,null,null,null,null,null,null,false]

{"sheet":"Output","index":2,"n_rows":275,"n_cols":52,"rows_kept":275,"cut":false,"hidden":false,"merged":[]}
["Input:  Well ID","X\n(Easting)\n(L)","Y \n(Northing) \n(L)","Z \n(Hydraulic Head) \n(L)","+/- \non Head (L)","Adjusted X-Coordinate","Adjusted Y-Coordinate",null,"Well A","Well B","Well C","Gradient","Flow Direction from X Direction",null,"Gradient","Direction","AB/BC","AC/BC","AC/AB","AB/H1","BC/H2","AC/H3","Max DWL (L)",null,null,"Gradient Bin Range",null,null,null,null,null,"Rotated Direction \n(o)  --->",{"$f":"Input!N28","v":0},"Direction Bin Range",null,null,null,null,null,null,"Velocity\n(m/d)",null,null,"Velocity Bin Range",null,null,null,null,null,null,"Estimator Area","gradient"]
["18HD07",1520940.6969999999,658569.67599999998,774.75,107,601.29399999999441,0,null,"18HD07","18HD05(65)","MW108S",8.7342580070510578E-4,176.57356556612888,"Avg",{"$f":"AVERAGE(L2:L200)","v":1.6017035295263723E-3},{"$f":"AVERAGE(M2:M200)","v":184.6153305680111},0.60253852635219562,1.5116014629394157,2.5087216780821331,0.93557822378915256,2.5769765279531494,5.8882341263791638,57.000000000005002,null,"max",{"$f":"MAX(L2:L1000)","v":4.4840142617822163E-3},null,null,null,null,null,176.57356556612888,"max",{"$f":"IF(MAX(AF2:AF1000)+45<360, MAX(AF2:AF1000)+45,MAX(AF2:AF1000))","v":282.80412953472279},null,null,null,null,null,null,{"$f":"L2*Input!$E$5/Input!$E$7","v":7.2785483392092143},null,"max",{"$f":"MAX(AO2:AO1000)","v":37.366785514851799},null,null,null,null,null,null,95932.294257019224,8.7342580070510578E-4]
["18HD05(65)",1520575.0079999999,658783.62899999996,774.42,"n",235.60499999998137,213.95299999997951,null,"18HD07","18HD05(65)","HR6",1.7401205926997072E-3,213.07918334678567,"StDev",{"$f":"STDEV(L2:L200)","v":4.2073056682410736E-4},{"$f":"STDEV(M2:M200)","v":24.347584537358681},0.58101667107903443,0.59899110294484381,1.0309361723346564,1.0779601312276859,3.1931955184839151,1.1456877102564031,109.00000000000318,null,"min",{"$f":"MIN(L2:L1000)","v":5.6138569157225147E-4},null,null,null,null,null,213.07918334678567,"min",{"$f":"IF(MIN(AF2:AF1000)-45<0,MIN(AF2:AF1000),MIN(AF2:AF1000)-45)","v":12.021012998124242},null,null,null,null,null,null,{"$f":"L3*Input!$E$5/Input!$E$7","v":14.501004939164227},null,"min",{"$f":"MIN(AO2:AO1000)","v":4.6782140964354291},null,null,null,null,null,null,83261.11779549942,1.7401205926997072E-3]
["MW108S",1520339.4029999999,659446.14,774.18,0.35,0,876.46400000003632,null,"18HD07","18HD05(65)","HR13",1.5034246405873108E-3,208.46606684913041,null,null,null,0.64286411281981204,0.8903816940557564,1.3850231741047907,0.73399728520717344,1.7760536835638379,1.408019059762825,99.000000000000909,null,null,null,null,null,null,null,null,208.46606684913041,null,null,null,null,null,null,null,null,{"$f":"L4*Input!$E$5/Input!$E$7","v":12.528538671560923},null,null,null,null,null,null,null,null,null,122278.60684752735,1.5034246405873108E-3]
["HR6",1521303.632,658812.69999999995,775.51,"Speed (L/T)",964.22900000005029,243.02399999997579,null,"18HD07","18HD05(65)","HAS",7.9054747278982287E-4,139.818022641433,"All Wells",1.4696267471909523E-3,174.80992223838734,0.30133177888110707,1.1715334971047866,3.8878524576958902,0.34085700919721074,3.7538970518307857,5.1521889231755802,100.99999999999909,null,null,{"$f":"$Z$2","v":4.4840142617822163E-3},null,"Bin","Frequency",null,null,139.818022641433,null,{"$f":"$AH$2","v":282.80412953472279},{"$f":"AK15","v":0},"Bin","Frequency",null,null,null,{"$f":"L5*Input!$E$5/Input!$E$7","v":6.5878956065818572},null,null,{"$f":"AR2","v":37.366785514851799},null,"Bin","Frequency",null,null,null,263313.24585750903,7.9054747278982287E-4]
["HR13",1521141.023,659121.22900000005,775.41,0,801.62000000011176,551.55300000007264,null,"18HD07","18HD05(65)","18HD06",1.9653611435363895E-3,216.32180732157002,null,null,null,0.76558677600441893,0.4045593524519131,0.52843043418709468,2.0686583452848102,3.5293922119246455,0.57764951626416772,77.00000000000955,null,null,{"$f":"Z5-($Z$2-$Z$3)/9","v":4.0481666428699983E-3},null,5.6138569157225104E-4,0,null,null,216.32180732157002,null,{"$f":"AH5-($AH$2-$AH$3)/9","v":252.71711658621183},{"$f":"AK14","v":4},12.021012998124206,0,null,null,null,{"$f":"L6*Input!$E$5/Input!$E$7","v":16.378009529469914},null,null,{"$f":"AR5-($AR$2-$AR$3)/9","v":33.734722023916646},null,0.17162362570923109,0,null,null,null,43386.654770507019,1.9653611435363895E-3]
["HAS",1520635.4639999999,660188.35199999996,773.74,null,296.06099999998696,1618.6759999999776,null,"18HD07","18HD05(65)","18HD08(47)",1.2337505739868683E-3,200.52192566306127,null,null,null,1.001552046569046,1.162166727070703,1.1603657853347358,1.0593253629638097,1.0560447578256391,1.4263273169240498,49.000000000000909,null,null,{"$f":"Z6-($Z$2-$Z$3)/9","v":3.6123190239577799E-3},null,9.9723331048446944E-4,8,null,null,200.52192566306127,null,{"$f":"AH6-($AH$2-$AH$3)/9","v":222.63010363770087},{"$f":"AK13","v":129},42.108025946635152,0,null,null,null,{"$f":"L7*Input!$E$5/Input!$E$7","v":10.281254783223902},null,null,{"$f":"AR6-($AR$2-$AR$3)/9","v":30.102658532981494},null,0.30486846920525212,8,null,null,null,84725.777936524886,1.2337505739868683E-3]
["18HD06",1521122.1769999999,658700.78500000003,775.19,null,782.77399999997579,131.10900000005495,null,"18HD07","18HD05(65)","18HD09(62)",1.2524453704200588E-3,201.21474075413221,null,null,null,0.80296585631746409,1.3485253009016784,1.6794304394040382,0.80770803870599761,1.2527379903588287,2.2781297005261623,47.000000000002728,null,null,3.1764714050455615E-3,null,1.4330809293966879E-3,86,null,null,201.21474075413221,null,192.54309068918991,{"$f":"AK12","v":101},72.195038895146098,2,null,null,null,{"$f":"L8*Input!$E$5/Input!$E$7","v":10.437044753500491},null,null,26.470595042046341,null,0.43811331270127318,86,null,null,null,111119.56445151809,1.2524453704200588E-3]
["18HD08(47)",1520895.9110000001,659059.255,774.91,null,556.50800000014715,489.57900000002701,null,"18HD07","18HD05(65)","HAH",1.2651124128315535E-3,201.66890088645278,null,null,null,0.59589312579279574,1.2580498657185097,2.1112005010038652,0.60706618640923282,1.7096188295487287,2.7057957100672994,59.000000000003183,null,null,2.7406237861333431E-3,null,1.8689285483089063E-3,130,null,null,201.66890088645278,null,162.45607774067895,{"$f":"AK11","v":31},102.28205184365704,2,null,null,null,{"$f":"L9*Input!$E$5/Input!$E$7","v":10.542603440262946},null,null,22.838531551111188,null,0.57135815619729424,130,null,null,null,147845.76620200195,1.2651124128315535E-3]
["18HD09(62)",1520790.6189999999,659265.20900000003,774.89,null,451.2160000000149,695.53300000005402,null,"18HD07","18HD05(65)","18HD03(57)",1.4052065608015981E-3,206.00769447415405,null,null,null,0.27792298716881969,0.93088577984304222,3.3494378760314314,0.30033500366788984,3.8882753634771587,3.3693785426858716,210.00000000000227,null,null,2.3047761672211247E-3,null,2.3047761672211247E-3,41,null,null,206.00769447415405,null,132.36906479216799,{"$f":"AK10","v":5},132.36906479216799,5,null,null,null,{"$f":"L10*Input!$E$5/Input!$E$7","v":11.710054673346651},null,null,19.206468060176036,null,0.7046029996933153,41,null,null,null,298840.17636601633,1.4052065608015981E-3]
["HAH",1520810.2479999999,659454.58499999996,775.01,null,470.84499999997206,884.9089999999851,null,"18HD07","18HD05(65)","MW125S",1.5240630798284789E-3,208.93486492268127,null,null,null,0.39475355947458246,0.77734679452710465,1.969195149403477,0.5517195513939066,3.5405135839137918,2.1394192002683683,159.00000000000318,null,null,1.8689285483089063E-3,null,2.7406237861333431E-3,6,null,null,208.93486492268127,null,102.28205184365704,{"$f":"AK9","v":2},162.45607774067895,31,null,null,null,{"$f":"L11*Input!$E$5/Input!$E$7","v":12.700525665237324},null,null,15.574404569240883,null,0.83784784318933636,6,null,null,null,162677.15225651077,1.5240630798284789E-3]
["18HD03(57)",1521786.139,659709.43000000005,776.52,null,1446.7360000000335,1139.7540000000736,null,"18HD07","18HD05(65)","MW133S",1.2606172903704958E-3,201.50910212996547,null,null,null,0.17624589668170132,0.88465961651411562,5.0194622012210806,0.24844520137479492,7.9982059655849254,6.2595770447822581,300.99999999999909,null,null,1.4330809293966879E-3,null,3.1764714050455615E-3,0,null,null,201.50910212996547,null,72.195038895146098,{"$f":"AK8","v":2},192.54309068918991,101,null,null,null,{"$f":"L12*Input!$E$5/Input!$E$7","v":10.505144086420797},null,null,11.942341078305731,null,0.97109268668535742,0,null,null,null,361255.37932851311,1.2606172903704958E-3]
["MW125S",1521609.98,659067.80200000003,776.01,null,1270.5770000000484,498.1260000000475,null,"18HD07","18HD05(65)","MW132S",1.2642993906640592E-3,201.64010842006172,null,null,null,0.19764222860456496,0.9339589828572904,4.7255031956046194,0.2179971478674112,5.5807340533432068,4.8679592492581385,263.99999999999864,null,null,9.9723331048446944E-4,null,3.6123190239577799E-3,1,null,null,201.64010842006172,null,42.108025946635152,{"$f":"AK7","v":0},222.63010363770087,129,null,null,null,{"$f":"L13*Input!$E$5/Input!$E$7","v":10.535828255533827},null,null,8.3102775873705781,null,1.1043375301813785,1,null,null,null,411712.56754051131,1.2642993906640592E-3]
["MW133S",1522898.5730000001,659399.93700000003,777.43,null,2559.1700000001583,830.26100000005681,null,"18HD07","MW108S","HR6",1.8150807839940443E-3,197.2671616079023,null,null,null,0.92130528790211963,0.37860196105436372,0.41094083147668503,2.4335947050389297,2.867088667345604,0.41096689809714082,133.00000000000409,null,null,5.6138569157225104E-4,null,4.0481666428699983E-3,1,null,null,197.2671616079023,null,12.021012998124206,{"$f":"AK6","v":0},252.71711658621183,4,null,null,null,{"$f":"L14*Input!$E$5/Input!$E$7","v":15.125673199950372},null,null,4.6782140964354255,null,1.2375823736773994,1,null,null,null,232114.1674480231,1.8150807839940443E-3]
["MW132S",1522337.139,660004.37100000004,777.06,null,1997.7360000000335,1434.6950000000652,null,"18HD07","MW108S","HR13",1.8463797321618695E-3,197.56728848755341,null,null,null,1.2288310835433456,0.67841703710590462,0.55208323274968185,2.2273069406502239,1.4750124756963854,0.67887401438266493,123.00000000000182,null,null,null,null,4.4840142617822163E-3,1,null,null,197.56728848755341,null,null,null,282.80412953472279,0,null,null,null,{"$f":"L15*Input!$E$5/Input!$E$7","v":15.38649776801558},null,null,null,null,1.3708272171734204,1,null,null,null,253612.01842307547,1.8463797321618695E-3]
[null,null,null,null,null,null,null,null,"18HD07","MW108S","HAS",6.1625434308078969E-4,94.935135896812199,null,null,null,1.3301451449940787,2.0613717799939137,1.5497344690177328,1.6007148583159498,0.90472357874052844,3.8443999378603553,100.99999999999909,null,null,null,null,"More",0,null,null,94.935135896812199,null,null,null,"More",0,null,null,null,{"$f":"L16*Input!$E$5/Input!$E$7","v":5.1354528590065813},null,null,null,null,"More",0,null,null,null,352887.21531597967,6.1625434308078969E-4]
[null,null,null,null,null,null,null,null,"18HD07","MW108S","18HD06",2.050301396958274E-3,199.28938746806128,null,null,null,0.98336504174862949,0.20713338610478829,0.21063732928360115,4.7489022264349456,4.9109294787208988,0.21069969520642634,101.00000000001046,null,null,null,null,null,null,null,null,199.28938746806128,null,null,null,null,null,null,null,null,{"$f":"L17*Input!$E$5/Input!$E$7","v":17.085844974652282},null,null,null,null,null,null,null,null,null,118947.87088301123,2.050301396958274E-3]
[null,null,null,null,null,null,null,null,"18HD07","MW108S","18HD08(47)",1.7113344398738211E-3,196.18976902148651,null,null,null,1.5682068968580376,0.72534695392401793,0.46253268964527466,4.4281513418235408,1.8005937419165401,0.94734315078826425,73.000000000001819,null,null,null,null,null,null,null,null,196.18976902148651,null,null,null,null,null,null,null,null,{"$f":"L18*Input!$E$5/Input!$E$7","v":14.261120332281843},null,null,null,null,null,null,null,null,null,127563.79926107283,1.7113344398738211E-3]
[null,null,null,null,null,null,null,null,"18HD07","MW108S","18HD09(62)",1.9052420599981659E-3,198.10382659722984,null,null,null,2.1863957276153858,1.4636536087762881,0.66943673109562674,3.9407573099529087,0.8243699448524382,1.7660328006190704,71.000000000003638,null,null,null,null,null,null,null,null,198.10382659722984,null,null,null,null,null,null,null,null,{"$f":"L19*Input!$E$5/Input!$E$7","v":15.877017166651383},null,null,null,null,null,null,null,null,null,143340.92775502041,1.9052420599981659E-3]
[null,null,null,null,null,null,null,null,"18HD07","MW108S","HAH",1.8378098513345308E-3,197.48617531222132,null,null,null,2.2570549971242229,1.8994118328681067,0.84154432891010666,2.7043105097306377,0.53085055144732285,1.9151842047516074,83.000000000004093,null,null,null,null,null,null,null,null,197.48617531222132,null,null,null,null,null,null,null,null,{"$f":"L20*Input!$E$5/Input!$E$7","v":15.315082094454423},null,null,null,null,null,null,null,null,null,208878.30995498085,1.8378098513345308E-3]
[null,null,null,null,null,null,null,null,"18HD07","MW108S","18HD03(57)",1.5962318318081181E-3,194.82089705518928,null,null,null,0.72281187371733213,0.96503868413370431,1.3351173648692705,0.79206510182391288,1.5160388215049243,1.4118864418561687,234.00000000000318,null,null,null,null,null,null,null,null,194.82089705518928,null,null,null,null,null,null,null,null,{"$f":"L21*Input!$E$5/Input!$E$7","v":13.301931931734318},null,null,null,null,null,null,null,null,null,713163.35938205163,1.5962318318081181E-3]
[null,null,null,null,null,null,null,null,"18HD07","MW108S","MW125S",1.6231722315824882E-3,195.1597427989899,null,null,null,0.80175484871828862,0.62932918103284463,0.78493966333837673,1.2749292017043488,1.9833660657857743,0.78552247975587441,183.00000000000409,null,null,null,null,null,null,null,null,195.1597427989899,null,null,null,null,null,null,null,null,{"$f":"L22*Input!$E$5/Input!$E$7","v":13.526435263187402},null,null,null,null,null,null,null,null,null,443061.31517804868,1.6231722315824882E-3]
[null,null,null,null,null,null,null,null,"18HD07","MW108S","MW133S",1.293466375962213E-3,189.95772991084732,null,null,null,0.41525994877128297,0.83085406992294375,2.0008047305822934,0.50998728613402899,2.9574625728896864,2.0415910842623815,325,null,null,null,null,null,null,null,null,189.95772991084732,null,null,null,null,null,null,null,null,{"$f":"L23*Input!$E$5/Input!$E$7","v":10.778886466351777},null,null,null,null,null,null,null,null,null,1107619.3940991217,1.293466375962213E-3]
[null,null,null,null,null,null,null,null,"18HD07","MW108S","MW132S",1.3915478840894622E-3,191.78468723350545,null,null,null,0.51241982840207501,0.96520931666533827,1.8836299127518887,0.54142677439430253,2.061996268944843,1.9210155735444694,287.99999999999955,null,null,null,null,null,null,null,null,191.78468723350545,null,null,null,null,null,null,null,null,{"$f":"L24*Input!$E$5/Input!$E$7","v":11.596232367412185},null,null,null,null,null,null,null,null,null,1043302.318209058,1.3915478840894622E-3]
[null,null,null,null,null,null,null,null,"18HD07","HR6","HR13",1.8027762034130315E-3,198.63951881137024,null,null,null,1.2524073908039153,1.682561254743187,1.3434616140864177,1.2593413092213508,0.80288289525912837,2.2729714129275713,75.999999999999091,null,null,null,null,null,null,null,null,198.63951881137024,null,null,null,null,null,null,null,null,{"$f":"L25*Input!$E$5/Input!$E$7","v":15.02313502844193},null,null,null,null,null,null,null,null,null,75746.931115516782,1.8027762034130315E-3]
[null,null,null,null,null,null,null,null,"18HD07","HR6","HAS",2.2395010308373228E-3,174.78872558844694,null,null,null,0.28560544941064309,1.0770713825162586,3.7711863857599117,0.28834214397672886,3.5348838166029384,4.1007577849741557,176.99999999999818,null,null,null,null,null,null,null,null,174.78872558844694,null,null,null,null,null,null,null,null,{"$f":"L26*Input!$E$5/Input!$E$7","v":18.662508590311024},null,null,null,null,null,null,null,null,null,330826.55932603835,2.2395010308373228E-3]
[null,null,null,null,null,null,null,null,"18HD07","HR6","18HD08(47)",1.8332379898591841E-3,195.45264091741475,null,null,null,0.91670933439524216,1.031798258004978,1.1255457093012591,1.0117360041049617,1.2039373784078258,1.2817209374216323,75.999999999999091,null,null,null,null,null,null,null,null,195.45264091741475,null,null,null,null,null,null,null,null,{"$f":"L27*Input!$E$5/Input!$E$7","v":15.276983248826536},null,null,null,null,null,null,null,null,null,94284.713614499473,1.8332379898591841E-3]
[null,null,null,null,null,null,null,null,"18HD07","HR6","18HD09(62)",1.8045255600499404E-3,198.43595042964978,null,null,null,0.63851489638996584,1.0401627004529308,1.6290343519529469,0.66036217390595542,1.6197206576999603,1.7524380471566401,75.999999999999091,null,null,null,null,null,null,null,null,198.43595042964978,null,null,null,null,null,null,null,null,{"$f":"L28*Input!$E$5/Input!$E$7","v":15.037713000416172},null,null,null,null,null,null,null,null,null,144452.912613525,1.8045255600499404E-3]
[null,null,null,null,null,null,null,null,"18HD07","HR6","HAH",1.8118216574524717E-3,197.6178403918486,null,null,null,0.53951236935883407,1.1048392859363279,2.0478479246904726,0.54066446773631971,1.8574837219259785,2.2673743720383204,75.999999999999091,null,null,null,null,null,null,null,null,197.6178403918486,null,null,null,null,null,null,null,null,{"$f":"L29*Input!$E$5/Input!$E$7","v":15.098513812103931},null,null,null,null,null,null,null,null,null,176433.34284552315,1.8118216574524717E-3]
[null,null,null,null,null,null,null,null,"18HD07","HR13","HAS",3.2995233814822962E-3,179.96913900082424,null,null,null,0.49694685285741996,1.3949629719912391,2.8070667194495158,0.69900667355291379,2.8304887488011823,5.5079094587261235,166.99999999999591,null,null,null,null,null,null,null,null,179.96913900082424,null,null,null,null,null,null,null,null,{"$f":"L30*Input!$E$5/Input!$E$7","v":27.496028179019135},null,null,null,null,null,null,null,null,null,246307.5326126061,3.2995233814822962E-3]
[null,null,null,null,null,null,null,null,"18HD07","HR13","18HD06",2.1579375546164521E-3,191.45207453170821,null,null,null,1.3942815902848011,0.53196281470848927,0.38153183576054284,4.6638923128174596,2.3990954551102002,0.67890667483250133,65.999999999996817,null,null,null,null,null,null,null,null,191.45207453170821,null,null,null,null,null,null,null,null,{"$f":"L31*Input!$E$5/Input!$E$7","v":17.982812955137103},null,null,null,null,null,null,null,null,null,36915.648452988244,2.1579375546164521E-3]
[null,null,null,null,null,null,null,null,"18HD07","HR13","18HD08(47)",1.977727690667726E-3,194.69839522164818,null,null,null,2.3209930986951282,1.9445169077872104,0.83779521312684024,2.804601038927629,0.52062305029951228,1.9685517665792833,65.999999999996817,null,null,null,null,null,null,null,null,194.69839522164818,null,null,null,null,null,null,null,null,{"$f":"L32*Input!$E$5/Input!$E$7","v":16.481064088897718},null,null,null,null,null,null,null,null,null,61388.627705990933,1.977727690667726E-3]
[null,null,null,null,null,null,null,null,"18HD07","HR13","18HD09(62)",1.8118625736481026E-3,198.4105015484582,null,null,null,1.5489898646882081,1.878250687586615,1.2125648659196895,1.5503231742100483,0.64613770784798441,2.2794611762187516,65.999999999996817,null,null,null,null,null,null,null,null,198.4105015484582,null,null,null,null,null,null,null,null,{"$f":"L33*Input!$E$5/Input!$E$7","v":15.098854780400854},null,null,null,null,null,null,null,null,null,111054.657446046,1.8118625736481026E-3]
[null,null,null,null,null,null,null,null,"18HD07","HR13","HAH",1.8529609435280784E-3,197.41114065791413,null,null,null,1.2495466411626701,1.9046926753087903,1.5243069866816048,1.381676711579962,0.88491487337278774,3.2103421288358471,65.999999999996817,null,null,null,null,null,null,null,null,197.41114065791413,null,null,null,null,null,null,null,null,{"$f":"L34*Input!$E$5/Input!$E$7","v":15.44134119606732},null,null,null,null,null,null,null,null,null,124609.90881556127,1.8529609435280784E-3]
[null,null,null,null,null,null,null,null,"18HD07","HR13","MW125S",1.5304412399724354E-3,207.33821293359239,null,null,null,1.2432577358479691,1.7676362018076517,1.4217777624379937,1.2783801175564231,0.82706123791511654,2.5841840527622111,125.99999999999909,null,null,null,null,null,null,null,null,207.33821293359239,null,null,null,null,null,null,null,null,{"$f":"L35*Input!$E$5/Input!$E$7","v":12.753676999770295},null,null,null,null,null,null,null,null,null,134678.72871150519,1.5304412399724354E-3]
[null,null,null,null,null,null,null,null,"18HD07","HR13","MW133S",1.3116261222852882E-3,219.07698378130672,null,null,null,0.32975681303175947,1.1950715984791249,3.6240997949116691,0.3769267148910313,3.4663256836296563,4.9505929110513804,267.999999999995,null,null,null,null,null,null,null,null,219.07698378130672,null,null,null,null,null,null,null,null,{"$f":"L36*Input!$E$5/Input!$E$7","v":10.930217685710735},null,null,null,null,null,null,null,null,null,456774.75817106193,1.3116261222852882E-3]
[null,null,null,null,null,null,null,null,"18HD07","HAS","18HD03(57)",2.3470436004415203E-3,175.53471611924684,null,null,null,1.3216087378881272,1.1385839385993604,0.86151362801880949,1.5808083196203353,0.90505174528485821,1.1732849948490727,277.99999999999727,null,null,null,null,null,null,null,null,175.53471611924684,null,null,null,null,null,null,null,null,{"$f":"L37*Input!$E$5/Input!$E$7","v":19.558696670346002},null,null,null,null,null,null,null,null,null,858193.6037370374,2.3470436004415203E-3]
[null,null,null,null,null,null,null,null,"18HD07","HAS","MW125S",2.0716262801258756E-3,173.46251680714013,null,null,null,1.1092055900320097,0.56181202639483174,0.50649945460391965,2.1962814922977105,1.7851055598449006,0.56343778225278518,226.99999999999818,null,null,null,null,null,null,null,null,173.46251680714013,null,null,null,null,null,null,null,null,{"$f":"L38*Input!$E$5/Input!$E$7","v":17.2635523343823},null,null,null,null,null,null,null,null,null,617698.41133304546,2.0716262801258756E-3]
[null,null,null,null,null,null,null,null,"18HD07","HAS","MW133S",1.549957220543217E-3,167.37554910803863,null,null,null,0.68733424319689551,0.88739176470095849,1.2910629340589306,0.79275613453460025,1.6780451778866439,1.3214004096969747,368.99999999999409,null,null,null,null,null,null,null,null,167.37554910803863,null,null,null,null,null,null,null,null,{"$f":"L39*Input!$E$5/Input!$E$7","v":12.916310171193475},null,null,null,null,null,null,null,null,null,1711294.9739946225,1.549957220543217E-3]
[null,null,null,null,null,null,null,null,"18HD07","HAS","MW132S",1.9404441172764532E-3,172.25826876695641,null,null,null,0.96238095452334771,1.1697291307922442,1.2154533246884471,1.0055500680479015,1.085699556034158,1.4855260486791411,331.99999999999363,null,null,null,null,null,null,null,null,172.25826876695641,null,null,null,null,null,null,null,null,{"$f":"L40*Input!$E$5/Input!$E$7","v":16.170367643970444},null,null,null,null,null,null,null,null,null,1349151.704863531,1.9404441172764532E-3]
[null,null,null,null,null,null,null,null,"18HD07","18HD06","18HD08(47)",2.1162627955339263E-3,194.0732098272502,null,null,null,0.52814700552062732,1.159743412159622,2.1958723613634632,0.52918305714522385,1.8971264862710446,2.5516441961837968,44.000000000005457,null,null,null,null,null,null,null,null,194.0732098272502,null,null,null,null,null,null,null,null,{"$f":"L41*Input!$E$5/Input!$E$7","v":17.635523296116055},null,null,null,null,null,null,null,null,null,47360.322296989136,2.1162627955339263E-3]
[null,null,null,null,null,null,null,null,"18HD07","18HD06","18HD09(62)",2.0689407637559439E-3,197.63334105453117,null,null,null,0.34201665905699863,1.0869797627897946,3.1781485901499447,0.34354973064616823,2.9369401183317838,3.470068187158335,44.000000000005457,null,null,null,null,null,null,null,null,197.63334105453117,null,null,null,null,null,null,null,null,{"$f":"L42*Input!$E$5/Input!$E$7","v":17.241173031299535},null,null,null,null,null,null,null,null,null,72950.952671001171,2.0689407637559439E-3]
[null,null,null,null,null,null,null,null,"18HD07","18HD06","HAH",2.0841453521081017E-3,196.40300331946005,null,null,null,0.27443951549065304,1.0964486621411835,3.9952288218440861,0.28207989541453449,3.7452330404350862,4.5025179204572678,44.000000000005457,null,null,null,null,null,null,null,null,196.40300331946005,null,null,null,null,null,null,null,null,{"$f":"L43*Input!$E$5/Input!$E$7","v":17.367877934234183},null,null,null,null,null,null,null,null,null,88848.16163049548,2.0841453521081017E-3]
[null,null,null,null,null,null,null,null,"18HD07","18HD08(47)","18HD03(57)",1.5421738773886422E-3,197.40979633215562,null,null,null,0.44596679872179201,1.2872993205848022,2.8865362270787776,0.51982027066176084,2.6136543695158427,4.331190001652141,176.99999999999818,null,null,null,null,null,null,null,null,197.40979633215562,null,null,null,null,null,null,null,null,{"$f":"L44*Input!$E$5/Input!$E$7","v":12.851448978238684},null,null,null,null,null,null,null,null,null,232477.83578093571,1.5421738773886422E-3]
[null,null,null,null,null,null,null,null,"18HD07","18HD08(47)","MW125S",1.6044112663485695E-3,196.93037396845813,null,null,null,0.68843206957365755,1.1683015039151392,1.6970468918431738,0.69059993187282975,1.4571502830733392,1.988905810336846,125.99999999999909,null,null,null,null,null,null,null,null,196.93037396845813,null,null,null,null,null,null,null,null,{"$f":"L45*Input!$E$5/Input!$E$7","v":13.370093886238079},null,null,null,null,null,null,null,null,null,174987.98644648527,1.6044112663485695E-3]
[null,null,null,null,null,null,null,null,"18HD07","18HD08(47)","MW133S",1.2617136477319157E-3,200.17493965095892,null,null,null,0.24200810732197767,1.0468686361183057,4.3257585363679905,0.2427325103915427,4.1444615716940447,4.5420561047841481,267.999999999995,null,null,null,null,null,null,null,null,200.17493965095892,null,null,null,null,null,null,null,null,{"$f":"L46*Input!$E$5/Input!$E$7","v":10.514280397765965},null,null,null,null,null,null,null,null,null,497859.52167500398,1.2617136477319157E-3]
[null,null,null,null,null,null,null,null,"18HD07","18HD08(47)","MW132S",1.2819757067083874E-3,199.93330390728215,null,null,null,0.28525035839575719,1.1616608290097628,4.0724254845565211,0.32315279279192194,3.9715086802282582,5.3593757475804882,230.99999999999454,null,null,null,null,null,null,null,null,199.93330390728215,null,null,null,null,null,null,null,null,{"$f":"L47*Input!$E$5/Input!$E$7","v":10.683130889236562},null,null,null,null,null,null,null,null,null,373961.46409392031,1.2819757067083874E-3]
[null,null,null,null,null,null,null,null,"18HD07","18HD09(62)","18HD03(57)",1.4995116421365358E-3,199.71599063936696,null,null,null,0.65270893707509181,1.3017556336774061,1.9943891675680303,0.66697364058780129,1.5655594070605992,2.6529464503067239,176.99999999999818,null,null,null,null,null,null,null,null,199.71599063936696,null,null,null,null,null,null,null,null,{"$f":"L48*Input!$E$5/Input!$E$7","v":12.495930351137799},null,null,null,null,null,null,null,null,null,379542.40569903032,1.4995116421365358E-3]
[null,null,null,null,null,null,null,null,"18HD07","18HD09(62)","MW125S",1.5821288875656611E-3,199.32016282036889,null,null,null,0.84425154053002893,0.98991658093210355,1.1725374884251023,0.93711135623464081,1.314763010891594,1.2883820770402969,125.99999999999909,null,null,null,null,null,null,null,null,199.32016282036889,null,null,null,null,null,null,null,null,{"$f":"L49*Input!$E$5/Input!$E$7","v":13.184407396380509},null,null,null,null,null,null,null,null,null,270133.08333353529,1.5821288875656611E-3]
[null,null,null,null,null,null,null,null,"18HD07","18HD09(62)","MW133S",1.2608421183719265E-3,201.15404858550789,null,null,null,0.3368628465684893,1.0068117652710222,2.9887883912609587,0.34062119443241257,3.0016872401523353,3.0427200966727277,267.999999999995,null,null,null,null,null,null,null,null,201.15404858550789,null,null,null,null,null,null,null,null,{"$f":"L50*Input!$E$5/Input!$E$7","v":10.507017653099389},null,null,null,null,null,null,null,null,null,743185.6391331061,1.2608421183719265E-3]
[null,null,null,null,null,null,null,null,"18HD07","18HD09(62)","MW132S",1.2698195862723329E-3,201.090057787875,null,null,null,0.41511396101465653,1.1680283406146617,2.8137534516055984,0.4266769170065739,2.4760788409933201,3.3780901082850012,230.99999999999454,null,null,null,null,null,null,null,null,201.090057787875,null,null,null,null,null,null,null,null,{"$f":"L51*Input!$E$5/Input!$E$7","v":10.581829885602774},null,null,null,null,null,null,null,null,null,593293.82489804167,1.2698195862723329E-3]
[null,null,null,null,null,null,null,null,"18HD07","HAH","18HD03(57)",1.5026003897552574E-3,199.53990885182176,null,null,null,0.8868301632339044,1.4069637331605285,1.5865086591438333,0.89213194192401191,1.1343528772262395,2.2455047742861649,176.99999999999818,null,null,null,null,null,null,null,null,199.53990885182176,null,null,null,null,null,null,null,null,{"$f":"L52*Input!$E$5/Input!$E$7","v":12.521669914627145},null,null,null,null,null,null,null,null,null,448409.50216202834,1.5026003897552574E-3]
[null,null,null,null,null,null,null,null,"18HD07","HAH","MW125S",1.5853525705776244E-3,198.95080916674397,null,null,null,1.0068876467454362,0.93916151925058888,0.93273715521909673,1.2173444512668776,1.2007468479841998,1.0590879692040034,125.99999999999909,null,null,null,null,null,null,null,null,198.95080916674397,null,null,null,null,null,null,null,null,{"$f":"L53*Input!$E$5/Input!$E$7","v":13.211271421480204},null,null,null,null,null,null,null,null,null,328617.29441052768,1.5853525705776244E-3]
[null,null,null,null,null,null,null,null,"18HD07","HAH","MW133S",1.2605075084467475E-3,201.71832015508417,null,null,null,0.42817391975027808,1.0180003295344302,2.3775393189014267,0.43462606778464313,2.3706931740951047,2.4568078235253425,267.999999999995,null,null,null,null,null,null,null,null,201.71832015508417,null,null,null,null,null,null,null,null,{"$f":"L54*Input!$E$5/Input!$E$7","v":10.504229237056229},null,null,null,null,null,null,null,null,null,920424.40523657098,1.2605075084467475E-3]
[null,null,null,null,null,null,null,null,"18HD07","HAH","MW132S",1.2638853809609388E-3,201.68203306464108,null,null,null,0.551171849624009,1.233688764040699,2.2383014750885417,0.5622973510215914,1.8509384646488003,2.8171060699649741,230.99999999999454,null,null,null,null,null,null,null,null,201.68203306464108,null,null,null,null,null,null,null,null,{"$f":"L55*Input!$E$5/Input!$E$7","v":10.53237817467449},null,null,null,null,null,null,null,null,null,711439.31091652752,1.2638853809609388E-3]
[null,null,null,null,null,null,null,null,"18HD07","18HD03(57)","MW125S",1.6597720290051395E-3,192.15131178492592,null,null,null,2.132777574389102,1.2538985375121257,0.58791809918166638,5.8938289904159316,1.2957057899186395,2.0371883837217597,176.99999999999818,null,null,null,null,null,null,null,null,192.15131178492592,null,null,null,null,null,null,null,null,{"$f":"L56*Input!$E$5/Input!$E$7","v":13.83143357504283},null,null,null,null,null,null,null,null,null,170840.66734502575,1.6597720290051395E-3]
[null,null,null,null,null,null,null,null,"18HD07","18HD03(57)","MW133S",1.2995871050036096E-3,217.1217467151414,null,null,null,1.2289839611920166,1.8417533829346338,1.4985983878489997,1.3165956469111988,0.871685826521711,2.9568067226542345,267.999999999995,null,null,null,null,null,null,null,null,217.1217467151414,null,null,null,null,null,null,null,null,{"$f":"L57*Input!$E$5/Input!$E$7","v":10.829892541696747},null,null,null,null,null,null,null,null,null,764779.74107112514,1.2995871050036096E-3]
[null,null,null,null,null,null,null,null,"18HD07","MW133S","MW132S",1.2603708609876126E-3,202.04186111525826,null,null,null,2.5778941585537836,2.4269227649952057,0.94143615514328416,2.7417352436413198,0.41256781962278444,2.4300055237072109,267.999999999995,null,null,null,null,null,null,null,null,202.04186111525826,null,null,null,null,null,null,null,null,{"$f":"L58*Input!$E$5/Input!$E$7","v":10.503090508230105},null,null,null,null,null,null,null,null,null,824771.7882291252,1.2603708609876126E-3]
[null,null,null,null,null,null,null,null,"18HD05(65)","MW108S","HR6",1.4986679082316515E-3,186.41214105344125,null,null,null,0.60948954502238739,0.63206608444270351,1.037041717293915,1.0099267653229618,2.7186754255455381,1.0861313180040655,133.00000000000409,null,null,null,null,null,null,null,null,186.41214105344125,null,null,null,null,null,null,null,null,{"$f":"L59*Input!$E$5/Input!$E$7","v":12.488899235263762},null,null,null,null,null,null,null,null,null,244785.34390954272,1.4986679082316515E-3]
[null,null,null,null,null,null,null,null,"18HD05(65)","MW108S","HR13",1.6353535846290756E-3,187.52975261448495,null,null,null,0.81293324574706149,0.7619395610164259,0.93727199004664408,1.0877807967875435,1.6460067733940185,0.95559235088730421,123.00000000000182,null,null,null,null,null,null,null,null,187.52975261448495,null,null,null,null,null,null,null,null,{"$f":"L60*Input!$E$5/Input!$E$7","v":13.627946538575632},null,null,null,null,null,null,null,null,null,227265.70583256704,1.6353535846290756E-3]
[null,null,null,null,null,null,null,null,"18HD05(65)","MW108S","HAS",5.6138569157225147E-4,57.021012998124242,null,null,null,0.8799575665979561,1.7595500129430244,1.9995850706139169,1.3326518772012259,1.7210490790872082,5.3283959125416951,67.999999999994998,null,null,null,null,null,null,null,null,57.021012998124242,null,null,null,null,null,null,null,null,{"$f":"L61*Input!$E$5/Input!$E$7","v":4.6782140964354291},null,null,null,null,null,null,null,null,null,185506.26371548985,5.6138569157225147E-4]
[null,null,null,null,null,null,null,null,"18HD05(65)","MW108S","18HD06",1.4367998681990601E-3,185.83440232090646,null,null,null,0.65054517732233919,0.51199752236455509,0.78702838820810272,1.4415430067315627,3.4062198872236564,0.89291146422123491,101.00000000001046,null,null,null,null,null,null,null,null,185.83440232090646,null,null,null,null,null,null,null,null,{"$f":"L62*Input!$E$5/Input!$E$7","v":11.973332234992167},null,null,null,null,null,null,null,null,null,171493.51036952346,1.4367998681990601E-3]
[null,null,null,null,null,null,null,null,"18HD05(65)","MW108S","18HD08(47)",1.4148043456160282E-3,185.61646113181646,null,null,null,1.0374473267633313,0.62413329948990182,0.60160480767452285,1.7814708393289185,1.6551852439189481,0.64476479186195046,73.000000000001819,null,null,null,null,null,null,null,null,185.61646113181646,null,null,null,null,null,null,null,null,{"$f":"L63*Input!$E$5/Input!$E$7","v":11.790036213466902},null,null,null,null,null,null,null,null,null,138770.31558156709,1.4148043456160282E-3]
[null,null,null,null,null,null,null,null,"18HD05(65)","MW108S","18HD09(62)",1.6816332802038637E-3,187.86605550793553,null,null,null,1.4464101690956195,1.0853734874663681,0.75039121727483937,1.9290535695891777,0.92206461335447043,1.0862249467581766,71.000000000003638,null,null,null,null,null,null,null,null,187.86605550793553,null,null,null,null,null,null,null,null,{"$f":"L64*Input!$E$5/Input!$E$7","v":14.013610668365532},null,null,null,null,null,null,null,null,null,128153.65756052155,1.6816332802038637E-3]
[null,null,null,null,null,null,null,null,"18HD05(65)","MW108S","HAH",1.7776281828552928E-3,188.50667231442773,null,null,null,1.4931548112789068,1.5098064747881008,1.0111520007057617,1.57497229129295,0.70642041511184583,1.6102963502685987,83.000000000004093,null,null,null,null,null,null,null,null,188.50667231442773,null,null,null,null,null,null,null,null,{"$f":"L65*Input!$E$5/Input!$E$7","v":14.813568190460774},null,null,null,null,null,null,null,null,null,156964.83800999797,1.7776281828552928E-3]
[null,null,null,null,null,null,null,null,"18HD05(65)","MW108S","18HD03(57)",1.5936361035713401E-3,187.20947164189769,null,null,null,0.47817622001487975,1.0366886088821989,2.1680053618097936,0.48449312468769518,2.1189058952903359,2.2772374763933039,234.00000000000318,null,null,null,null,null,null,null,null,187.20947164189769,null,null,null,null,null,null,null,null,{"$f":"L66*Input!$E$5/Input!$E$7","v":13.280300863094501},null,null,null,null,null,null,null,null,null,510255.47727305413,1.5936361035713401E-3]
[null,null,null,null,null,null,null,null,"18HD05(65)","MW108S","MW125S",1.4996336972103389E-3,186.42077145523402,null,null,null,0.53040094785249792,0.80958612740622937,1.5263662907920963,0.65693451842775286,2.3351430978465073,1.5305221346811935,183.00000000000409,null,null,null,null,null,null,null,null,186.42077145523402,null,null,null,null,null,null,null,null,{"$f":"L67*Input!$E$5/Input!$E$7","v":12.496947476752824},null,null,null,null,null,null,null,null,null,376316.45717855671,1.4996336972103389E-3]
[null,null,null,null,null,null,null,null,"18HD05(65)","MW108S","MW133S",1.2747437581641043E-3,184.04597098204806,null,null,null,0.27471523344769777,0.93917937974473675,3.4187378979969978,0.29350154799850203,3.8890623975742247,3.4303782399100915,325,null,null,null,null,null,null,null,null,184.04597098204806,null,null,null,null,null,null,null,null,{"$f":"L68*Input!$E$5/Input!$E$7","v":10.622864651367536},null,null,null,null,null,null,null,null,null,842296.30902762723,1.2747437581641043E-3]
[null,null,null,null,null,null,null,null,"18HD05(65)","MW108S","MW132S",1.4100528827217865E-3,185.56846096328806,null,null,null,0.33899135517217516,1.0334600709256445,3.0486325245690877,0.33980450805216,2.9570038496203725,3.1581975582578745,287.99999999999955,null,null,null,null,null,null,null,null,185.56846096328806,null,null,null,null,null,null,null,null,{"$f":"L69*Input!$E$5/Input!$E$7","v":11.750440689348221},null,null,null,null,null,null,null,null,null,727522.04492556548,1.4100528827217865E-3]
[null,null,null,null,null,null,null,null,"18HD05(65)","HR6","HR13",1.5462147628171326E-3,197.10443211297215,null,null,null,2.0908614245631614,1.8897078252799564,0.90379391148543886,2.3166502982405834,0.52991959766131913,1.8923405860070011,109.00000000000318,null,null,null,null,null,null,null,null,197.10443211297215,null,null,null,null,null,null,null,null,{"$f":"L70*Input!$E$5/Input!$E$7","v":12.885123023476106},null,null,null,null,null,null,null,null,null,114764.42016754473,1.5462147628171326E-3]
[null,null,null,null,null,null,null,null,"18HD05(65)","HR6","HAS",1.6142620536732895E-3,160.10204215388904,null,null,null,0.47681083743399477,0.91936883168772177,1.9281626160919436,0.52041518812978826,2.289062901885706,1.9348053495559139,176.99999999999818,null,null,null,null,null,null,null,null,160.10204215388904,null,null,null,null,null,null,null,null,{"$f":"L71*Input!$E$5/Input!$E$7","v":13.452183780610747},null,null,null,null,null,null,null,null,null,510878.68738804763,1.6142620536732895E-3]
[null,null,null,null,null,null,null,null,"18HD05(65)","HR6","18HD06",1.5485533009985915E-3,197.42801019827749,null,null,null,3.4204063456175744,2.5958038604586058,0.7589168064152676,6.9718878753486901,0.59592964054834241,4.0154917225611291,109.00000000000318,null,null,null,null,null,null,null,null,197.42801019827749,null,null,null,null,null,null,null,null,{"$f":"L72*Input!$E$5/Input!$E$7","v":12.904610841654929},null,null,null,null,null,null,null,null,null,38134.43832747425,1.5485533009985915E-3]
[null,null,null,null,null,null,null,null,"18HD05(65)","HR6","18HD08(47)",1.4949400759288361E-3,181.44946312085702,null,null,null,1.530422288224963,0.88782292073158475,0.58011630356044586,2.7767181943914139,1.1855209750280282,0.93446265111894133,109.00000000000318,null,null,null,null,null,null,null,null,181.44946312085702,null,null,null,null,null,null,null,null,{"$f":"L73*Input!$E$5/Input!$E$7","v":12.457833966073634},null,null,null,null,null,null,null,null,null,95749.373755525026,1.4949400759288361E-3]
[null,null,null,null,null,null,null,null,"18HD05(65)","HR6","18HD09(62)",1.5159344788378787E-3,191.86760741986885,null,null,null,1.0659839407477167,0.77133347053810264,0.72358826531388798,1.5429570594510591,1.3578522484931079,0.80786142277938378,109.00000000000318,null,null,null,null,null,null,null,null,191.86760741986885,null,null,null,null,null,null,null,null,{"$f":"L74*Input!$E$5/Input!$E$7","v":12.632787323648989},null,null,null,null,null,null,null,null,null,172311.35926954367,1.5159344788378787E-3]
[null,null,null,null,null,null,null,null,"18HD05(65)","HR6","HAH",1.5246930841275148E-3,193.65272065574433,null,null,null,0.9007018079340543,0.87821581325420783,0.97503502881667048,1.1031086386017477,1.3597410742580405,1.0487180000753453,109.00000000000318,null,null,null,null,null,null,null,null,193.65272065574433,null,null,null,null,null,null,null,null,{"$f":"L75*Input!$E$5/Input!$E$7","v":12.705775701062624},null,null,null,null,null,null,null,null,null,241017.99125202579,1.5246930841275148E-3]
[null,null,null,null,null,null,null,null,"18HD05(65)","HR6","18HD03(57)",1.5188007324889936E-3,192.48817168622227,null,null,null,0.71609813082619889,1.4970512384635,2.0905671639392156,0.83168274186688074,1.6218571858227335,3.6348453602032427,210.00000000000227,null,null,null,null,null,null,null,null,192.48817168622227,null,null,null,null,null,null,null,null,{"$f":"L76*Input!$E$5/Input!$E$7","v":12.656672770741613},null,null,null,null,null,null,null,null,null,319676.01926156733,1.5188007324889936E-3]
[null,null,null,null,null,null,null,null,"18HD05(65)","HR6","MW125S",1.4989891038583775E-3,186.57891301986427,null,null,null,1.8291580019920834,2.6922399245989528,1.4718465663802207,3.0047198787310703,0.89805213076298074,6.5092217707135722,159.00000000000318,null,null,null,null,null,null,null,null,186.57891301986427,null,null,null,null,null,null,null,null,{"$f":"L77*Input!$E$5/Input!$E$7","v":12.49157586548648},null,null,null,null,null,null,null,null,null,88483.79847003569,1.4989891038583775E-3]
[null,null,null,null,null,null,null,null,"18HD05(65)","HR6","MW132S",1.4958389397162655E-3,180.12998373177521,null,null,null,0.4622796649445351,1.3589818022695657,2.9397395241960691,0.63435438855891213,2.968399631897821,5.4821340602475628,263.99999999999864,null,null,null,null,null,null,null,null,180.12998373177521,null,null,null,null,null,null,null,null,{"$f":"L78*Input!$E$5/Input!$E$7","v":12.465324497635546},null,null,null,null,null,null,null,null,null,419117.50435357628,1.4958389397162655E-3]
[null,null,null,null,null,null,null,null,"18HD05(65)","HR13","HAS",2.1688499489420712E-3,164.65088817818184,null,null,null,0.55812788624818788,1.1907153960502319,2.1334096098555189,0.56067576944400321,1.7998832837759287,2.5518801972732525,166.99999999999591,null,null,null,null,null,null,null,null,164.65088817818184,null,null,null,null,null,null,null,null,{"$f":"L79*Input!$E$5/Input!$E$7","v":18.073749574517262},null,null,null,null,null,null,null,null,null,387342.17162258725,2.1688499489420712E-3]
[null,null,null,null,null,null,null,null,"18HD05(65)","HR13","18HD06",1.5455789021586877E-3,197.20139397894067,null,null,null,1.5659369454618306,1.3149190878530479,0.83970117166195868,1.8752946189946345,0.76475260708869308,1.3222665934504996,99.000000000000909,null,null,null,null,null,null,null,null,197.20139397894067,null,null,null,null,null,null,null,null,{"$f":"L80*Input!$E$5/Input!$E$7","v":12.879824184655732},null,null,null,null,null,null,null,null,null,115807.6005300086,1.5455789021586877E-3]
[null,null,null,null,null,null,null,null,"18HD05(65)","HR13","18HD09(62)",1.6137210797631224E-3,189.38463052186071,null,null,null,1.7396919490027265,1.3928182781077527,0.80061201576875829,2.1740030331043583,0.71831583170181257,1.3934915941086834,99.000000000000909,null,null,null,null,null,null,null,null,189.38463052186071,null,null,null,null,null,null,null,null,{"$f":"L81*Input!$E$5/Input!$E$7","v":13.447675664692687},null,null,null,null,null,null,null,null,null,99895.615050036751,1.6137210797631224E-3]
[null,null,null,null,null,null,null,null,"18HD05(65)","HR13","HAH",1.584517652588074E-3,192.26015267250472,null,null,null,1.4033831215362145,1.51400411637973,1.0788245156621408,1.4461153940408116,0.73426098287966513,1.6830792400462744,99.000000000000909,null,null,null,null,null,null,null,null,192.26015267250472,null,null,null,null,null,null,null,null,{"$f":"L82*Input!$E$5/Input!$E$7","v":13.204313771567284},null,null,null,null,null,null,null,null,null,150177.0681700359,1.584517652588074E-3]
[null,null,null,null,null,null,null,null,"18HD05(65)","HR13","MW125S",1.5074538887624583E-3,206.01192262670145,null,null,null,1.3963199649633806,2.2739351525633871,1.6285201168938543,2.3034890525801099,1.181452476938408,6.1090321123843445,159.00000000000318,null,null,null,null,null,null,null,null,206.01192262670145,null,null,null,null,null,null,null,null,{"$f":"L83*Input!$E$5/Input!$E$7","v":12.562115739687155},null,null,null,null,null,null,null,null,null,94280.183302521895,1.5074538887624583E-3]
[null,null,null,null,null,null,null,null,"18HD05(65)","HAS","18HD06",1.4315276172629488E-3,157.79005001311049,null,null,null,0.89832209015571518,0.35357584785823609,0.39359585134653341,2.5553603576753714,3.166561990817248,0.39587053445400699,145.00000000000455,null,null,null,null,null,null,null,null,157.79005001311049,null,null,null,null,null,null,null,null,{"$f":"L84*Input!$E$5/Input!$E$7","v":11.929396810524574},null,null,null,null,null,null,null,null,null,386814.64802549349,1.4315276172629488E-3]
[null,null,null,null,null,null,null,null,"18HD05(65)","HAS","18HD08(47)",2.0965197630865278E-3,164.19830071901029,null,null,null,1.2134006420294876,0.36506956898621473,0.3008648226653427,4.5538496533283022,3.0929311131881159,0.41221283814363324,116.99999999999591,null,null,null,null,null,null,null,null,164.19830071901029,null,null,null,null,null,null,null,null,{"$f":"L85*Input!$E$5/Input!$E$7","v":17.470998025721066},null,null,null,null,null,null,null,null,null,217058.28970661393,2.0965197630865278E-3]
[null,null,null,null,null,null,null,null,"18HD05(65)","HAS","18HD09(62)",3.664104849233977E-3,169.95091108529454,null,null,null,1.5020159061754967,0.56366671304219995,0.37527346463156613,7.2213123574392588,3.2008628586280716,1.0169786704380479,114.99999999999773,null,null,null,null,null,null,null,null,169.95091108529454,null,null,null,null,null,null,null,null,{"$f":"L86*Input!$E$5/Input!$E$7","v":30.534207076949809},null,null,null,null,null,null,null,null,null,136879.66513651979,3.664104849233977E-3]
[null,null,null,null,null,null,null,null,"18HD05(65)","HAS","HAH",4.4840142617822163E-3,171.34383324695611,null,null,null,1.8640190369326559,0.94259884525413318,0.50568091128791826,6.8196365668385193,1.9627299245136125,1.7438709805085713,126.99999999999818,null,null,null,null,null,null,null,null,171.34383324695611,null,null,null,null,null,null,null,null,{"$f":"L87*Input!$E$5/Input!$E$7","v":37.366785514851799},null,null,null,null,null,null,null,null,null,144941.86129199094,4.4840142617822163E-3]
[null,null,null,null,null,null,null,null,"18HD05(65)","HAS","18HD03(57)",2.2509234627207438E-3,165.12832777287272,null,null,null,1.1281015362806288,1.2231188436365827,1.0842276198552374,1.2015204328787901,0.94413648216273838,1.4124467821469211,277.99999999999727,null,null,null,null,null,null,null,null,165.12832777287272,null,null,null,null,null,null,null,null,{"$f":"L88*Input!$E$5/Input!$E$7","v":18.757695522672865},null,null,null,null,null,null,null,null,null,822666.67322853045,2.2509234627207438E-3]
[null,null,null,null,null,null,null,null,"18HD05(65)","HAS","MW125S",1.7785455888763659E-3,161.75671275940212,null,null,null,0.9467980153987845,0.72273022845177803,0.76334151180848142,1.3760313761111287,1.5350186588617607,0.80180008533694569,226.99999999999818,null,null,null,null,null,null,null,null,161.75671275940212,null,null,null,null,null,null,null,null,{"$f":"L89*Input!$E$5/Input!$E$7","v":14.821213240636384},null,null,null,null,null,null,null,null,null,718334.50493404327,1.7785455888763659E-3]
[null,null,null,null,null,null,null,null,"18HD05(65)","HAS","MW133S",1.5403075027460103E-3,159.23609186979803,null,null,null,0.58669619340420587,1.0030883609196592,1.7097236562920375,0.61266871852513871,1.7799146020168344,1.7909256161889524,368.99999999999409,null,null,null,null,null,null,null,null,159.23609186979803,null,null,null,null,null,null,null,null,{"$f":"L90*Input!$E$5/Input!$E$7","v":12.835895856216753},null,null,null,null,null,null,null,null,null,1613352.8405236185,1.5403075027460103E-3]
[null,null,null,null,null,null,null,null,"18HD05(65)","HAS","MW132S",1.9726557931969602E-3,163.34383900155535,null,null,null,0.82147113753186063,1.2524416513599501,1.5246325697126206,0.82319288404351043,1.2198796583798572,1.9135155407951017,331.99999999999363,null,null,null,null,null,null,null,null,163.34383900155535,null,null,null,null,null,null,null,null,{"$f":"L91*Input!$E$5/Input!$E$7","v":16.438798276641336},null,null,null,null,null,null,null,null,null,1200752.3831805289,1.9726557931969602E-3]
[null,null,null,null,null,null,null,null,"18HD05(65)","18HD06","18HD08(47)",1.430097288228406E-3,184.75209635253287,null,null,null,1.3054870745656637,0.9979148302436871,0.76440039100018964,1.7263751836233807,1.012954718701409,1.0087347578726682,77.00000000000955,null,null,null,null,null,null,null,null,184.75209635253287,null,null,null,null,null,null,null,null,{"$f":"L92*Input!$E$5/Input!$E$7","v":11.917477401903383},null,null,null,null,null,null,null,null,null,88699.445463006996,1.430097288228406E-3]
[null,null,null,null,null,null,null,null,"18HD05(65)","18HD06","18HD09(62)",1.491886980345872E-3,192.54115610883832,null,null,null,0.84540539474402965,0.80605070002245849,0.95344873008116204,1.0884583269781154,1.5229364334190245,0.9894788039884379,77.00000000000955,null,null,null,null,null,null,null,null,192.54115610883832,null,null,null,null,null,null,null,null,{"$f":"L93*Input!$E$5/Input!$E$7","v":12.432391502882266},null,null,null,null,null,null,null,null,null,140683.86235201225,1.491886980345872E-3]
[null,null,null,null,null,null,null,null,"18HD05(65)","18HD06","HAH",1.5079499559615141E-3,194.06640933496539,null,null,null,0.67836650871462323,0.87154626538986124,1.2847719546787137,0.79215085404150842,1.7213892951339655,1.3075550741794686,77.00000000000955,null,null,null,null,null,null,null,null,194.06640933496539,null,null,null,null,null,null,null,null,{"$f":"L94*Input!$E$5/Input!$E$7","v":12.566249633012619},null,null,null,null,null,null,null,null,null,193307.27306199033,1.5079499559615141E-3]
[null,null,null,null,null,null,null,null,"18HD05(65)","18HD06","18HD03(57)",1.5041567012732239E-3,193.71804609368428,null,null,null,0.45828217501724988,1.2624172489144567,2.7546723781411284,0.50462143669633119,2.4027011958410935,3.8291784334028858,210.00000000000227,null,null,null,null,null,null,null,null,193.71804609368428,null,null,null,null,null,null,null,null,{"$f":"L95*Input!$E$5/Input!$E$7","v":12.534639177276865},null,null,null,null,null,null,null,null,null,303452.27196647949,1.5041567012732239E-3]
[null,null,null,null,null,null,null,null,"18HD05(65)","18HD06","MW125S",1.4843397468324267E-3,191.77488537138439,null,null,null,0.90654755031210343,1.7581622753748347,1.939404364139024,1.2695546177692842,1.5447927128980343,4.7751621838913971,159.00000000000318,null,null,null,null,null,null,null,null,191.77488537138439,null,null,null,null,null,null,null,null,{"$f":"L96*Input!$E$5/Input!$E$7","v":12.369497890270223},null,null,null,null,null,null,null,null,null,120615.93830248171,1.4843397468324267E-3]
[null,null,null,null,null,null,null,null,"18HD05(65)","18HD06","MW132S",1.4276248577151454E-3,184.32771880529845,null,null,null,0.31055540730568021,1.2029671732025966,3.8735991868224469,0.37626758767725504,3.9013832777196198,5.6458088599456673,263.99999999999864,null,null,null,null,null,null,null,null,184.32771880529845,null,null,null,null,null,null,null,null,{"$f":"L97*Input!$E$5/Input!$E$7","v":11.89687381429288},null,null,null,null,null,null,null,null,null,406967.07998095569,1.4276248577151454E-3]
[null,null,null,null,null,null,null,null,"18HD05(65)","18HD08(47)","18HD09(62)",1.2156197878837747E-3,202.99916696790643,null,null,null,1.8288286960411373,2.2811270353941735,1.2473158586871071,1.8814402432039508,0.56252829728465337,2.927138806346687,49.000000000000909,null,null,null,null,null,null,null,null,202.99916696790643,null,null,null,null,null,null,null,null,{"$f":"L98*Input!$E$5/Input!$E$7","v":10.130164899031458},null,null,null,null,null,null,null,null,null,47556.234627042133,1.2156197878837747E-3]
[null,null,null,null,null,null,null,null,"18HD05(65)","18HD08(47)","HAH",1.2089155446247406E-3,204.02613367171682,null,null,null,1.0457803936310479,1.7577036018152725,1.680757846025742,1.1892352341571579,1.0873936111969691,3.3595264320774976,59.000000000003183,null,null,null,null,null,null,null,null,204.02613367171682,null,null,null,null,null,null,null,null,{"$f":"L99*Input!$E$5/Input!$E$7","v":10.074296205206171},null,null,null,null,null,null,null,null,null,75236.766514052215,1.2089155446247406E-3]
[null,null,null,null,null,null,null,null,"18HD05(65)","18HD08(47)","MW125S",1.5407413136738195E-3,179.40608362388292,null,null,null,0.59236945400156449,1.5029347417916219,2.5371577343143228,0.92206654459375958,2.6277070932003075,5.9354985168458994,159.00000000000318,null,null,null,null,null,null,null,null,179.40608362388292,null,null,null,null,null,null,null,null,{"$f":"L100*Input!$E$5/Input!$E$7","v":12.839510947281831},null,null,null,null,null,null,null,null,null,97036.612126499487,1.5407413136738195E-3]
[null,null,null,null,null,null,null,null,"18HD05(65)","18HD09(62)","18HD03(57)",1.532257857271793E-3,191.4255944708629,null,null,null,0.48401682685424158,1.3984053273398342,2.8891667598179485,0.72569282725458473,3.0976468934909991,6.0575645366259092,210.00000000000227,null,null,null,null,null,null,null,null,191.4255944708629,null,null,null,null,null,null,null,null,{"$f":"L101*Input!$E$5/Input!$E$7","v":12.768815477264942},null,null,null,null,null,null,null,null,null,191821.7937845322,1.532257857271793E-3]
[null,null,null,null,null,null,null,null,"18HD05(65)","18HD09(62)","MW125S",1.4829185121877622E-3,192.79949938158094,null,null,null,0.62605539544977629,1.2734555386367994,2.0340940240949639,0.63686782236925155,1.6248893094178065,2.6350651337371738,159.00000000000318,null,null,null,null,null,null,null,null,192.79949938158094,null,null,null,null,null,null,null,null,{"$f":"L102*Input!$E$5/Input!$E$7","v":12.357654268231352},null,null,null,null,null,null,null,null,null,218575.49552854276,1.4829185121877622E-3]
[null,null,null,null,null,null,null,null,"18HD05(65)","18HD09(62)","MW133S",1.2591437195144763E-3,200.90720445260786,null,null,null,0.24980090944029687,1.138078133642215,4.5559407137155317,0.28233191254163192,4.5245140355055229,5.860249386366454,300.99999999999909,null,null,null,null,null,null,null,null,200.90720445260786,null,null,null,null,null,null,null,null,{"$f":"L103*Input!$E$5/Input!$E$7","v":10.492864329287304},null,null,null,null,null,null,null,null,null,493049.8242561103,1.2591437195144763E-3]
[null,null,null,null,null,null,null,null,"18HD05(65)","18HD09(62)","MW132S",1.2711704171595073E-3,200.36716880389028,null,null,null,0.30782808504749193,1.2506205968931048,4.0627241555953493,0.47558356344949526,5.0189209488465547,7.8498527324314651,263.99999999999864,null,null,null,null,null,null,null,null,200.36716880389028,null,null,null,null,null,null,null,null,{"$f":"L104*Input!$E$5/Input!$E$7","v":10.593086809662562},null,null,null,null,null,null,null,null,null,292700.82180904871,1.2711704171595073E-3]
[null,null,null,null,null,null,null,null,"18HD05(65)","HAH","18HD03(57)",1.4971186798204039E-3,194.34003499919007,null,null,null,0.70492449258154743,1.5114246705946657,2.1440944193321814,0.84985568173416537,1.7102515058532379,3.9069062957602374,210.00000000000227,null,null,null,null,null,null,null,null,194.34003499919007,null,null,null,null,null,null,null,null,{"$f":"L105*Input!$E$5/Input!$E$7","v":12.475988998503366},null,null,null,null,null,null,null,null,null,297415.09199801384,1.4971186798204039E-3]
[null,null,null,null,null,null,null,null,"18HD05(65)","HAH","MW125S",1.4815298364850976E-3,194.74245208256883,null,null,null,0.80035591130592632,1.2081628506899851,1.5095319889855594,0.80551707083424073,1.2575012769816392,1.8355211372433875,159.00000000000318,null,null,null,null,null,null,null,null,194.74245208256883,null,null,null,null,null,null,null,null,{"$f":"L106*Input!$E$5/Input!$E$7","v":12.346081970709147},null,null,null,null,null,null,null,null,null,313785.90835601854,1.4815298364850976E-3]
[null,null,null,null,null,null,null,null,"18HD05(65)","HAH","MW133S",1.2614203422217527E-3,201.81478924061147,null,null,null,0.34034733552134294,1.1507254434713841,3.381032619834401,0.35750299511223615,3.0862775137315777,4.0867531518282139,300.99999999999909,null,null,null,null,null,null,null,null,201.81478924061147,null,null,null,null,null,null,null,null,{"$f":"L107*Input!$E$5/Input!$E$7","v":10.511836185181274},null,null,null,null,null,null,null,null,null,707014.79211006034,1.2614203422217527E-3]
[null,null,null,null,null,null,null,null,"18HD05(65)","HAH","MW132S",1.2639103911891941E-3,201.716268481827,null,null,null,0.43811605934174819,1.3209239235179642,3.0150091405062835,0.5647350995848901,2.9421610077888269,5.1336002473185411,263.99999999999864,null,null,null,null,null,null,null,null,201.716268481827,null,null,null,null,null,null,null,null,{"$f":"L108*Input!$E$5/Input!$E$7","v":10.532586593243286},null,null,null,null,null,null,null,null,null,447572.50957801868,1.2639103911891941E-3]
[null,null,null,null,null,null,null,null,"18HD05(65)","18HD03(57)","MW125S",1.4814914747866489E-3,195.80419478464216,null,null,null,2.2911270325224131,1.6130490874088304,0.70404175085523124,3.7848824874903646,0.721031205793493,1.8760708206073513,210.00000000000227,null,null,null,null,null,null,null,null,195.80419478464216,null,null,null,null,null,null,null,null,{"$f":"L109*Input!$E$5/Input!$E$7","v":12.345762289888741},null,null,null,null,null,null,null,null,null,307003.69145453122,1.4814914747866489E-3]
[null,null,null,null,null,null,null,null,"18HD05(65)","18HD03(57)","MW133S",1.3785539581509794E-3,219.5851766898725,null,null,null,1.3202306747012906,2.0818779884989209,1.5769047246004619,1.654372953552276,0.94914766411447193,4.1138109532490157,300.99999999999909,null,null,null,null,null,null,null,null,219.5851766898725,null,null,null,null,null,null,null,null,{"$f":"L110*Input!$E$5/Input!$E$7","v":11.487949651258161},null,null,null,null,null,null,null,null,null,702364.53810862766,1.3785539581509794E-3]
[null,null,null,null,null,null,null,null,"18HD05(65)","MW125S","MW132S",1.5639344244434202E-3,176.66147999200172,null,null,null,0.90517144159297835,1.8079114520534925,1.997313844625737,1.51035256095433,1.8433875480043098,6.0251929750669913,263.99999999999864,null,null,null,null,null,null,null,null,176.66147999200172,null,null,null,null,null,null,null,null,{"$f":"L111*Input!$E$5/Input!$E$7","v":13.032786870361836},null,null,null,null,null,null,null,null,null,381341.86828051758,1.5639344244434202E-3]
[null,null,null,null,null,null,null,null,"18HD05(65)","MW133S","MW132S",1.26212519795127E-3,202.07218361016226,null,null,null,2.9139955192163458,2.5985324939757457,0.89174210352751793,3.3013017253997758,0.38878317276435098,2.6252082685898848,300.99999999999909,null,null,null,null,null,null,null,null,202.07218361016226,null,null,null,null,null,null,null,null,{"$f":"L112*Input!$E$5/Input!$E$7","v":10.517709982927251},null,null,null,null,null,null,null,null,null,875228.97644112271,1.26212519795127E-3]
[null,null,null,null,null,null,null,null,"MW108S","HR6","HR13",1.8875721830966575E-3,199.05394153972355,null,null,null,3.3079791433623376,2.4801282437140943,0.74974119733814626,6.8434715438076763,0.62539001120264692,3.8467965387816641,133.00000000000409,null,null,null,null,null,null,null,null,199.05394153972355,null,null,null,null,null,null,null,null,{"$f":"L113*Input!$E$5/Input!$E$7","v":15.729768192472147},null,null,null,null,null,null,null,null,null,97244.782090568944,1.8875721830966575E-3]
[null,null,null,null,null,null,null,null,"MW108S","HR6","HAS",1.1981206739301812E-3,130.89341956036697,null,null,null,0.75436864778846935,0.52250224484951402,0.69263515441859613,1.4736325905055736,2.5895360226956234,0.70696559351811938,176.99999999999818,null,null,null,null,null,null,null,null,130.89341956036697,null,null,null,null,null,null,null,null,{"$f":"L114*Input!$E$5/Input!$E$7","v":9.9843389494181771},null,null,null,null,null,null,null,null,null,451599.60719399544,1.1981206739301812E-3]
[null,null,null,null,null,null,null,null,"MW108S","HR6","18HD06",1.6060679476909551E-3,190.82465776644378,null,null,null,5.411469512137117,5.0699539491332315,0.93689042094057495,5.972486451058681,0.2039504844246193,5.242431571659532,133.00000000000409,null,null,null,null,null,null,null,null,190.82465776644378,null,null,null,null,null,null,null,null,{"$f":"L115*Input!$E$5/Input!$E$7","v":13.383899564091294},null,null,null,null,null,null,null,null,null,111426.27186749366,1.6060679476909551E-3]
[null,null,null,null,null,null,null,null,"MW108S","HR6","HAH",1.8423956339789901E-3,197.9622132244964,null,null,null,1.4250120835516884,0.58167442511296963,0.40818911771134536,4.3440132028891041,2.1392130659750253,0.72379233751692129,133.00000000000409,null,null,null,null,null,null,null,null,197.9622132244964,null,null,null,null,null,null,null,null,{"$f":"L116*Input!$E$5/Input!$E$7","v":15.353296949824918},null,null,null,null,null,null,null,null,null,153197.48535248084,1.8423956339789901E-3]
[null,null,null,null,null,null,null,null,"MW108S","HR6","18HD03(57)",1.5912971933835702E-3,190.27363017580888,null,null,null,1.1329481971138935,1.4440703077442738,1.2746128299801722,1.1373088518741199,0.88605017165135247,1.8477150264898108,234.00000000000318,null,null,null,null,null,null,null,null,190.27363017580888,null,null,null,null,null,null,null,null,{"$f":"L117*Input!$E$5/Input!$E$7","v":13.260809944863086},null,null,null,null,null,null,null,null,null,585146.1526250788,1.5912971933835702E-3]
[null,null,null,null,null,null,null,null,"MW108S","HR6","MW125S",1.5004479272603829E-3,186.49390030647186,null,null,null,2.89393474355591,3.3254521458074051,1.149110964997528,3.02475815734662,0.36117126391989973,3.9940600872944869,183.00000000000409,null,null,null,null,null,null,null,null,186.49390030647186,null,null,null,null,null,null,null,null,{"$f":"L118*Input!$E$5/Input!$E$7","v":12.503732727169858},null,null,null,null,null,null,null,null,null,220014.91173904962,1.5004479272603829E-3]
[null,null,null,null,null,null,null,null,"MW108S","HR6","MW133S",1.2783713156610177E-3,172.30237332925151,null,null,null,0.67879144458622132,1.5059823349938524,2.2186230351089224,0.84424875119164144,1.8323047486943242,4.155635642145409,325,null,null,null,null,null,null,null,null,172.30237332925151,null,null,null,null,null,null,null,null,{"$f":"L119*Input!$E$5/Input!$E$7","v":10.653094297175148},null,null,null,null,null,null,null,null,null,788265.18615663634,1.2783713156610177E-3]
[null,null,null,null,null,null,null,null,"MW108S","HR6","MW132S",1.4245969832889778E-3,182.67651459294561,null,null,null,0.73137869017624935,1.3149823979675959,1.797950112069451,0.73791516972286408,1.3795004095315231,2.3854027344108668,287.99999999999955,null,null,null,null,null,null,null,null,182.67651459294561,null,null,null,null,null,null,null,null,{"$f":"L120*Input!$E$5/Input!$E$7","v":11.871641527408148},null,null,null,null,null,null,null,null,null,901854.20536959975,1.4245969832889778E-3]
[null,null,null,null,null,null,null,null,"MW108S","HR13","HAS",1.5220900201782664E-3,137.04506591778156,null,null,null,0.73250939418822969,0.67671585762921316,0.9238323262449798,1.0824640794285201,2.0173771438246737,0.92384646880150767,166.99999999999591,null,null,null,null,null,null,null,null,137.04506591778156,null,null,null,null,null,null,null,null,{"$f":"L121*Input!$E$5/Input!$E$7","v":12.684083501485553},null,null,null,null,null,null,null,null,null,345582.72950551059,1.5220900201782664E-3]
[null,null,null,null,null,null,null,null,"MW108S","HR13","18HD06",1.7724413447753784E-3,194.58633443275744,null,null,null,2.0551983721292455,2.5682137713877307,1.2496184340234691,2.1802152694931802,0.51616895750124392,3.4045069360854123,123.00000000000182,null,null,null,null,null,null,null,null,194.58633443275744,null,null,null,null,null,null,null,null,{"$f":"L122*Input!$E$5/Input!$E$7","v":14.77034453979482},null,null,null,null,null,null,null,null,null,171579.79599305245,1.7724413447753784E-3]
[null,null,null,null,null,null,null,null,"MW108S","HR13","18HD08(47)",1.9991167007591556E-3,202.5934279834637,null,null,null,3.4211892858651902,2.6808093661490768,0.78358989875975915,5.785389031031352,0.49428605857704844,3.5523048239617454,123.00000000000182,null,null,null,null,null,null,null,null,202.5934279834637,null,null,null,null,null,null,null,null,{"$f":"L123*Input!$E$5/Input!$E$7","v":16.659305839659631},null,null,null,null,null,null,null,null,null,64659.591456011556,1.9991167007591556E-3]
[null,null,null,null,null,null,null,null,"MW108S","HR13","HAH",1.8342794207005016E-3,197.10868518245249,null,null,null,1.8418562223808199,1.0027802514174662,0.54444002698606542,4.6832584616356421,1.3805008400604784,1.3881877898878165,123.00000000000182,null,null,null,null,null,null,null,null,197.10868518245249,null,null,null,null,null,null,null,null,{"$f":"L124*Input!$E$5/Input!$E$7","v":15.285661839170848},null,null,null,null,null,null,null,null,null,79876.200347466816,1.8342794207005016E-3]
[null,null,null,null,null,null,null,null,"MW108S","HR13","18HD03(57)",1.5979697506435036E-3,185.07633898586971,null,null,null,0.99077739273619558,1.6843913351960149,1.7000704169725649,1.0984303990182518,1.1189749560574764,3.1747268422964949,234.00000000000318,null,null,null,null,null,null,null,null,185.07633898586971,null,null,null,null,null,null,null,null,{"$f":"L125*Input!$E$5/Input!$E$7","v":13.316414588695864},null,null,null,null,null,null,null,null,null,340559.48514800891,1.5979697506435036E-3]
[null,null,null,null,null,null,null,null,"MW108S","HR13","MW132S",1.4856746539780696E-3,174.7683855714688,null,null,null,0.58175404035210532,1.3951010638890842,2.3980943270195469,0.68227108662663472,2.0159425462435987,3.9236430459373182,287.99999999999955,null,null,null,null,null,null,null,null,174.7683855714688,null,null,null,null,null,null,null,null,{"$f":"L126*Input!$E$5/Input!$E$7","v":12.380622116483913},null,null,null,null,null,null,null,null,null,548287.76785801188,1.4856746539780696E-3]
[null,null,null,null,null,null,null,null,"MW108S","HAS","18HD06",9.596461466131412E-4,123.23871082460829,null,null,null,0.51054081074580038,0.69058116966136651,1.3526463607337529,0.79651586503333516,3.055860347216504,1.4573469866375741,145.00000000000455,null,null,null,null,null,null,null,null,123.23871082460829,null,null,null,null,null,null,null,null,{"$f":"L127*Input!$E$5/Input!$E$7","v":7.9970512217761769},null,null,null,null,null,null,null,null,null,400827.40137146035,9.596461466131412E-4]
[null,null,null,null,null,null,null,null,"MW108S","HAS","18HD08(47)",1.1222814247298827E-3,128.87099856905925,null,null,null,0.68960849825459225,0.5849224344936933,0.84819493375464383,1.2102818732736975,2.5449621004034704,0.8707187106317037,116.99999999999591,null,null,null,null,null,null,null,null,128.87099856905925,null,null,null,null,null,null,null,null,{"$f":"L128*Input!$E$5/Input!$E$7","v":9.3523452060823562},null,null,null,null,null,null,null,null,null,263794.23784053716,1.1222814247298827E-3]
[null,null,null,null,null,null,null,null,"MW108S","HAS","18HD09(62)",1.5599089136695899E-3,137.58312166326314,null,null,null,0.85363638153326704,0.51932972340976413,0.60837346514796509,1.6437298612099536,2.2557169996710695,0.60837445766758969,114.99999999999773,null,null,null,null,null,null,null,null,137.58312166326314,null,null,null,null,null,null,null,null,{"$f":"L129*Input!$E$5/Input!$E$7","v":12.999240947246582},null,null,null,null,null,null,null,null,null,194232.27129148858,1.5599089136695899E-3]
[null,null,null,null,null,null,null,null,"MW108S","HAS","HAH",2.2123226663085158E-3,143.84139793847197,null,null,null,1.0593725800466998,0.62431765990831745,0.5893277508473892,1.840323583084311,1.6398221027286544,0.63915762690497613,126.99999999999818,null,null,null,null,null,null,null,null,143.84139793847197,null,null,null,null,null,null,null,null,{"$f":"L130*Input!$E$5/Input!$E$7","v":18.436022219237632},null,null,null,null,null,null,null,null,null,173483.28699748343,2.2123226663085158E-3]
[null,null,null,null,null,null,null,null,"MW108S","HAS","18HD03(57)",2.2897512053806305E-3,144.33874156022944,null,null,null,0.64113070272652573,1.17983243295728,1.8402369874657796,0.64120142431524596,1.5599164153989959,2.1714107788317483,277.99999999999727,null,null,null,null,null,null,null,null,144.33874156022944,null,null,null,null,null,null,null,null,{"$f":"L131*Input!$E$5/Input!$E$7","v":19.08126004483859},null,null,null,null,null,null,null,null,null,497917.4596709662,2.2897512053806305E-3]
[null,null,null,null,null,null,null,null,"MW108S","HAS","MW125S",1.5377539505194574E-3,137.27136574943725,null,null,null,0.53809099396678672,0.89271567778375571,1.6590422210984967,0.60521454156718613,2.0902484386042328,1.6658052690238994,226.99999999999818,null,null,null,null,null,null,null,null,137.27136574943725,null,null,null,null,null,null,null,null,{"$f":"L132*Input!$E$5/Input!$E$7","v":12.814616254328813},null,null,null,null,null,null,null,null,null,527524.31147097657,1.5377539505194574E-3]
[null,null,null,null,null,null,null,null,"MW108S","HAS","MW133S",1.6596771677876794E-3,138.87714362350565,null,null,null,0.33343536079596703,1.0680476834918293,3.2031626188122866,0.33376312138699499,3.0020300741661763,3.4244933207241144,368.99999999999409,null,null,null,null,null,null,null,null,138.87714362350565,null,null,null,null,null,null,null,null,{"$f":"L133*Input!$E$5/Input!$E$7","v":13.83064306489733},null,null,null,null,null,null,null,null,null,956562.79521148046,1.6596771677876794E-3]
[null,null,null,null,null,null,null,null,"MW108S","HAS","MW132S",2.236012780275195E-3,143.99734026107279,null,null,null,0.4668643297941088,1.2118916701234226,2.5958112299088629,0.48466319220375209,2.2236101692414572,3.2657749411426726,331.99999999999363,null,null,null,null,null,null,null,null,143.99734026107279,null,null,null,null,null,null,null,null,{"$f":"L134*Input!$E$5/Input!$E$7","v":18.633439835626625},null,null,null,null,null,null,null,null,null,658736.60197045375,2.236012780275195E-3]
[null,null,null,null,null,null,null,null,"MW108S","18HD06","18HD09(62)",1.8522771040795413E-3,196.10615753454536,null,null,null,1.6511904019372965,0.74264823061419694,0.44976535095096731,6.0008274601876606,2.2009837130791401,1.2139006114833704,101.00000000001046,null,null,null,null,null,null,null,null,196.10615753454536,null,null,null,null,null,null,null,null,{"$f":"L135*Input!$E$5/Input!$E$7","v":15.435642533996177},null,null,null,null,null,null,null,null,null,97344.009543010514,1.8522771040795413E-3]
[null,null,null,null,null,null,null,null,"MW108S","18HD06","HAH",1.8204174928214208E-3,195.51850839377045,null,null,null,1.3249409988972747,0.57725693984202942,0.43568501565161799,3.2674190493449426,1.8612802047502577,0.62022616571166389,101.00000000001046,null,null,null,null,null,null,null,null,195.51850839377045,null,null,null,null,null,null,null,null,{"$f":"L136*Input!$E$5/Input!$E$7","v":15.170145773511841},null,null,null,null,null,null,null,null,null,178778.60070246496,1.8204174928214208E-3]
[null,null,null,null,null,null,null,null,"MW108S","18HD06","18HD03(57)",1.5913008302371472E-3,190.44339620758103,null,null,null,0.89508670452303774,1.2177400601282269,1.3604716213242385,0.90957903172355981,1.135298927687173,1.6835243964699742,234.00000000000318,null,null,null,null,null,null,null,null,190.44339620758103,null,null,null,null,null,null,null,null,{"$f":"L137*Input!$E$5/Input!$E$7","v":13.260840251976227},null,null,null,null,null,null,null,null,null,642214.23887001059,1.5913008302371472E-3]
[null,null,null,null,null,null,null,null,"MW108S","18HD06","MW125S",1.5258600218941364E-3,188.63984543530125,null,null,null,1.770609252414739,2.1716803387030299,1.2265158649438401,1.7949440963402519,0.57253951839586081,2.7002082965145475,183.00000000000409,null,null,null,null,null,null,null,null,188.63984543530125,null,null,null,null,null,null,null,null,{"$f":"L138*Input!$E$5/Input!$E$7","v":12.715500182451137},null,null,null,null,null,null,null,null,null,325438.88511151494,1.5258600218941364E-3]
[null,null,null,null,null,null,null,null,"MW108S","18HD06","MW133S",1.2697365924826561E-3,179.01741870787635,null,null,null,0.56619025006599411,1.3407787111211926,2.3680709990412478,0.62431168024150141,1.9474965067488146,3.5009902281271605,325,null,null,null,null,null,null,null,null,179.01741870787635,null,null,null,null,null,null,null,null,{"$f":"L139*Input!$E$5/Input!$E$7","v":10.581138270688802},null,null,null,null,null,null,null,null,null,935661.82411404443,1.2697365924826561E-3]
[null,null,null,null,null,null,null,null,"MW108S","18HD06","MW132S",1.4126488908318721E-3,184.99042033720542,null,null,null,0.60655646510054206,1.1640190144212623,1.9190612604027162,0.60659113783329077,1.6487453696073733,2.2339514895536725,287.99999999999955,null,null,null,null,null,null,null,null,184.99042033720542,null,null,null,null,null,null,null,null,{"$f":"L140*Input!$E$5/Input!$E$7","v":11.772074090265601},null,null,null,null,null,null,null,null,null,962995.61453699879,1.4126488908318721E-3]
[null,null,null,null,null,null,null,null,"MW108S","18HD08(47)","18HD09(62)",2.1254831652577038E-3,204.74651397670198,null,null,null,2.9301892681192006,2.1016977673916672,0.71725665992240939,6.2180078860811516,0.72420233657136035,3.1988984056011369,73.000000000001819,null,null,null,null,null,null,null,null,204.74651397670198,null,null,null,null,null,null,null,null,{"$f":"L141*Input!$E$5/Input!$E$7","v":17.712359710480868},null,null,null,null,null,null,null,null,null,36939.576605996575,2.1254831652577038E-3]
[null,null,null,null,null,null,null,null,"MW108S","18HD08(47)","HAH",1.8621423803595657E-3,199.85530144185438,null,null,null,1.6755721806315322,1.1641913259525289,0.6948022528720541,2.4583903448659927,0.8756379170243741,1.1867883583758185,83.000000000004093,null,null,null,null,null,null,null,null,199.85530144185438,null,null,null,null,null,null,null,null,{"$f":"L142*Input!$E$5/Input!$E$7","v":15.517853169663049},null,null,null,null,null,null,null,null,null,93431.28894248321,1.8621423803595657E-3]
[null,null,null,null,null,null,null,null,"MW108S","18HD08(47)","18HD03(57)",1.5926076981662221E-3,192.6391893861128,null,null,null,0.61483238650025152,1.3339354595307076,2.1695920527604833,0.65045722993638899,1.7207004537600101,3.0617865296129985,234.00000000000318,null,null,null,null,null,null,null,null,192.6391893861128,null,null,null,null,null,null,null,null,{"$f":"L143*Input!$E$5/Input!$E$7","v":13.271730818051852},null,null,null,null,null,null,null,null,null,353121.72434004303,1.5926076981662221E-3]
[null,null,null,null,null,null,null,null,"MW108S","18HD08(47)","MW125S",1.570264677574513E-3,191.8861766263831,null,null,null,0.94910727321503663,1.8564235365627604,1.9559680859617179,1.6346975148957752,1.8147081905820546,6.2540439847612701,183.00000000000409,null,null,null,null,null,null,null,null,191.8861766263831,null,null,null,null,null,null,null,null,{"$f":"L144*Input!$E$5/Input!$E$7","v":13.085538979787609},null,null,null,null,null,null,null,null,null,140509.5294704905,1.570264677574513E-3]
[null,null,null,null,null,null,null,null,"MW108S","18HD08(47)","MW133S",1.2703296072221874E-3,177.21416672602371,null,null,null,0.33364461794834899,1.259990982791233,3.7764462994763193,0.47634269839215515,4.2790884673719694,6.793383615853883,325,null,null,null,null,null,null,null,null,177.21416672602371,null,null,null,null,null,null,null,null,{"$f":"L145*Input!$E$5/Input!$E$7","v":10.586080060184896},null,null,null,null,null,null,null,null,null,482196.07316304412,1.2703296072221874E-3]
[null,null,null,null,null,null,null,null,"MW108S","18HD08(47)","MW132S",1.4107028259541657E-3,185.42049519360367,null,null,null,0.39326057254751762,1.2035325487979507,3.0603946411447791,0.4239577453246991,2.7413327814702804,3.970794754510337,287.99999999999955,null,null,null,null,null,null,null,null,185.42049519360367,null,null,null,null,null,null,null,null,{"$f":"L146*Input!$E$5/Input!$E$7","v":11.755856882951381},null,null,null,null,null,null,null,null,null,541777.05485406565,1.4107028259541657E-3]
[null,null,null,null,null,null,null,null,"MW108S","18HD09(62)","HAH",1.8119132123018578E-3,194.43855267136553,null,null,null,2.5533817906529581,2.4734457269174346,0.96869404174959595,2.6553855533938182,0.40728280431817226,2.491729220037243,83.000000000004093,null,null,null,null,null,null,null,null,194.43855267136553,null,null,null,null,null,null,null,null,{"$f":"L147*Input!$E$5/Input!$E$7","v":15.099276769182149},null,null,null,null,null,null,null,null,null,44500.487907481816,1.8119132123018578E-3]
[null,null,null,null,null,null,null,null,"MW108S","18HD09(62)","18HD03(57)",1.6054946643799411E-3,182.68887008718698,null,null,null,0.44594495115603194,1.3489154943524009,3.0248475531690189,0.62101080831897659,3.1227459672796289,5.6820642819712628,234.00000000000318,null,null,null,null,null,null,null,null,182.68887008718698,null,null,null,null,null,null,null,null,{"$f":"L148*Input!$E$5/Input!$E$7","v":13.379122203166176},null,null,null,null,null,null,null,null,null,190280.02592800066,1.6054946643799411E-3]
[null,null,null,null,null,null,null,null,"MW108S","18HD09(62)","MW132S",1.5083055961978592E-3,172.61610784558798,null,null,null,0.2836148925712822,1.210129575468702,4.2668054716645551,0.38532262938946898,4.7903412402241781,7.0150408101627972,287.99999999999955,null,null,null,null,null,null,null,null,172.61610784558798,null,null,null,null,null,null,null,null,{"$f":"L149*Input!$E$5/Input!$E$7","v":12.569213301648828},null,null,null,null,null,null,null,null,null,306667.56555599545,1.5083055961978592E-3]
[null,null,null,null,null,null,null,null,"MW108S","18HD03(57)","MW125S",1.5936029152779549E-3,193.3970892906645,null,null,null,2.2100436070121408,1.9924366695570166,0.90153726525364042,2.4519814265664346,0.50201360864970601,1.9928955725325534,234.00000000000318,null,null,null,null,null,null,null,null,193.3970892906645,null,null,null,null,null,null,null,null,{"$f":"L150*Input!$E$5/Input!$E$7","v":13.280024293982958},null,null,null,null,null,null,null,null,null,440942.71154902835,1.5936029152779549E-3]
[null,null,null,null,null,null,null,null,"MW108S","MW125S","MW133S",1.3985123100030228E-3,154.18505582752073,null,null,null,0.99624318859286931,1.9234766302897977,1.930730018848698,1.9323296178414617,1.9469306420689836,7.2031806822749695,325,null,null,null,null,null,null,null,null,154.18505582752073,null,null,null,null,null,null,null,null,{"$f":"L151*Input!$E$5/Input!$E$7","v":11.654269250025189},null,null,null,null,null,null,null,null,null,454763.3951645277,1.3985123100030228E-3]
[null,null,null,null,null,null,null,null,"MW108S","MW125S","MW132S",1.4409844019683375E-3,180.09240587656723,null,null,null,1.1180668874514776,1.7493771679385648,1.5646444658835181,1.1995847782365878,0.95961134768392475,2.9367182560357485,287.99999999999955,null,null,null,null,null,null,null,null,180.09240587656723,null,null,null,null,null,null,null,null,{"$f":"L152*Input!$E$5/Input!$E$7","v":12.008203349736146},null,null,null,null,null,null,null,null,null,732547.45602752687,1.4409844019683375E-3]
[null,null,null,null,null,null,null,null,"MW108S","MW133S","MW132S",1.4044255290174377E-3,204.26384211139353,null,null,null,3.1027038945513814,2.5144004757225931,0.81039008593056516,4.3076107622229536,0.44746162109961107,2.8289462247021944,325,null,null,null,null,null,null,null,null,204.26384211139353,null,null,null,null,null,null,null,null,{"$f":"L153*Input!$E$5/Input!$E$7","v":11.703546075145315},null,null,null,null,null,null,null,null,null,760454.71233906201,1.4044255290174377E-3]
[null,null,null,null,null,null,null,null,"HR6","HR13","18HD06",1.5505861177092393E-3,197.13491291366569,null,null,null,0.82866616971850671,0.50655564077200288,0.61129035947500676,1.6396293546686889,2.3877368761543747,0.61268998065372815,31.999999999993634,null,null,null,null,null,null,null,null,197.13491291366569,null,null,null,null,null,null,null,null,{"$f":"L154*Input!$E$5/Input!$E$7","v":12.921550980910329},null,null,null,null,null,null,null,null,null,37091.257965010402,1.5505861177092393E-3]
[null,null,null,null,null,null,null,null,"HR6","HR13","18HD08(47)",1.9861456546138917E-3,199.49072250293017,null,null,null,1.3794404763286829,1.8845902216844304,1.3661990162128488,1.4192465765196496,0.74585074006351326,2.6490233829602068,60.000000000002274,null,null,null,null,null,null,null,null,199.49072250293017,null,null,null,null,null,null,null,null,{"$f":"L155*Input!$E$5/Input!$E$7","v":16.5512137884491},null,null,null,null,null,null,null,null,null,42850.845207008242,1.9861456546138917E-3]
[null,null,null,null,null,null,null,null,"HR6","HR13","18HD09(62)",1.8206402386463764E-3,198.73007567358891,null,null,null,0.92061424826083604,1.8057277835176604,1.9614380148133952,1.4360759575019912,1.6944237382079501,5.5249275541020735,62.000000000000455,null,null,null,null,null,null,null,null,198.73007567358891,null,null,null,null,null,null,null,null,{"$f":"L156*Input!$E$5/Input!$E$7","v":15.172001988719805},null,null,null,null,null,null,null,null,null,42348.675948037766,1.8206402386463764E-3]
[null,null,null,null,null,null,null,null,"HR6","HR13","18HD03(57)",1.417494627268449E-3,196.12092301367721,null,null,null,0.39948635529123511,1.1664192014495036,2.9197973497721996,0.41275374752732452,2.5863489796456944,3.518815085164368,111.00000000000136,null,null,null,null,null,null,null,null,196.12092301367721,null,null,null,null,null,null,null,null,{"$f":"L157*Input!$E$5/Input!$E$7","v":11.812455227237075},null,null,null,null,null,null,null,null,null,147341.88538650115,1.417494627268449E-3]
[null,null,null,null,null,null,null,null,"HR6","HR13","MW125S",1.3733831931612868E-3,195.74054962338192,null,null,null,0.73890785987326824,0.84462574519695588,1.1430731638743423,0.89435746239482905,1.6380628559928947,1.1685820008016072,60.000000000002274,null,null,null,null,null,null,null,null,195.74054962338192,null,null,null,null,null,null,null,null,{"$f":"L158*Input!$E$5/Input!$E$7","v":11.444859943010725},null,null,null,null,null,null,null,null,null,67999.561605012554,1.3733831931612868E-3]
[null,null,null,null,null,null,null,null,"HR6","HR13","MW133S",1.1381842521485657E-3,193.20010001907309,null,null,null,0.19598502705453716,0.95510099173821028,4.8733365303076566,0.20700627508344488,5.3893665710738468,4.9162766796124817,201.99999999999818,null,null,null,null,null,null,null,null,193.20010001907309,null,null,null,null,null,null,null,null,{"$f":"L159*Input!$E$5/Input!$E$7","v":9.4848687679047146},null,null,null,null,null,null,null,null,null,293787.7865610827,1.1381842521485657E-3]
[null,null,null,null,null,null,null,null,"HR6","HR13","MW132S",1.2008628417065875E-3,193.97723648108527,null,null,null,0.2345661123881661,1.0609275576960711,4.5229361858562944,0.23726405504492951,4.312224954205977,4.8536993240059809,164.99999999999773,null,null,null,null,null,null,null,null,193.97723648108527,null,null,null,null,null,null,null,null,{"$f":"L160*Input!$E$5/Input!$E$7","v":10.007190347554896},null,null,null,null,null,null,null,null,null,256321.65542101805,1.2008628417065875E-3]
[null,null,null,null,null,null,null,null,"HR6","HAS","18HD08(47)",1.2727384901004266E-3,140.49055539979196,null,null,null,1.3198192066202636,0.41119637763506911,0.31155507934154342,5.9041117044029949,3.3894222602701931,0.57309185706756427,176.99999999999818,null,null,null,null,null,null,null,null,140.49055539979196,null,null,null,null,null,null,null,null,{"$f":"L161*Input!$E$5/Input!$E$7","v":10.606154084170221},null,null,null,null,null,null,null,null,null,198071.02392590899,1.2727384901004266E-3]
[null,null,null,null,null,null,null,null,"HR6","HAS","18HD09(62)",1.2308526325537962E-3,96.007587627407588,null,null,null,1.633746821086143,0.73076916090387101,0.44729645467223805,5.7982398792954646,2.1723343399346646,1.1600777319034792,176.99999999999818,null,null,null,null,null,null,null,null,96.007587627407588,null,null,null,null,null,null,null,null,{"$f":"L162*Input!$E$5/Input!$E$7","v":10.257105271281635},null,null,null,null,null,null,null,null,null,201687.66298198426,1.2308526325537962E-3]
[null,null,null,null,null,null,null,null,"HR6","HAS","18HD03(57)",2.3611869580682692E-3,176.55504476737337,null,null,null,1.2270391353269265,0.81701869128536442,0.66584566682763691,1.8519400016712817,1.2300140824796257,0.82105843687921765,277.99999999999727,null,null,null,null,null,null,null,null,176.55504476737337,null,null,null,null,null,null,null,null,{"$f":"L163*Input!$E$5/Input!$E$7","v":19.676557983902246},null,null,null,null,null,null,null,null,null,631464.00510205003,2.3611869580682692E-3]
[null,null,null,null,null,null,null,null,"HR6","HAS","MW125S",1.9568424151707488E-3,169.64666611514681,null,null,null,1.0298347983591198,0.26844941338556183,0.26067230764904603,3.9515948098030105,3.7259522169490489,0.26851107271056662,226.99999999999818,null,null,null,null,null,null,null,null,169.64666611514681,null,null,null,null,null,null,null,null,{"$f":"L164*Input!$E$5/Input!$E$7","v":16.307020126422909},null,null,null,null,null,null,null,null,null,295939.61601603124,1.9568424151707488E-3]
[null,null,null,null,null,null,null,null,"HR6","HAS","MW133S",1.542615593019515E-3,157.29325655286993,null,null,null,0.63815105883803391,0.70920332773769845,1.111340830537896,0.9042745071309356,2.2205128934687961,1.1168499490645667,368.99999999999409,null,null,null,null,null,null,null,null,157.29325655286993,null,null,null,null,null,null,null,null,{"$f":"L165*Input!$E$5/Input!$E$7","v":12.855129941829293},null,null,null,null,null,null,null,null,null,1293228.3741741215,1.542615593019515E-3]
[null,null,null,null,null,null,null,null,"HR6","HAS","MW132S",1.9455207032919616E-3,169.40171727045615,null,null,null,0.89351640953919831,0.92160295985443785,1.0314337263595688,1.054502010935729,1.320816077530776,1.1218377977041087,331.99999999999363,null,null,null,null,null,null,null,null,169.40171727045615,null,null,null,null,null,null,null,null,{"$f":"L166*Input!$E$5/Input!$E$7","v":16.212672527433014},null,null,null,null,null,null,null,null,null,1108991.2001460572,1.9455207032919616E-3]
[null,null,null,null,null,null,null,null,"HR6","18HD06","18HD08(47)",1.6336947418791772E-3,188.41206854709955,null,null,null,0.5029220791493163,1.1240021032813439,2.2349428467777224,0.50294922392360264,1.9884869159192065,2.5122160478121689,60.000000000002274,null,null,null,null,null,null,null,null,188.41206854709955,null,null,null,null,null,null,null,null,{"$f":"L167*Input!$E$5/Input!$E$7","v":13.614122848993144},null,null,null,null,null,null,null,null,null,45184.366619992295,1.6336947418791772E-3]
[null,null,null,null,null,null,null,null,"HR6","18HD06","18HD09(62)",1.5791740798093363E-3,193.56057133273924,null,null,null,0.32568153843282682,1.0450093647046539,3.2086846854544424,0.32575704852785903,3.0711960443403155,3.3538829707537987,62.000000000000455,null,null,null,null,null,null,null,null,193.56057133273924,null,null,null,null,null,null,null,null,{"$f":"L168*Input!$E$5/Input!$E$7","v":13.159783998411136},null,null,null,null,null,null,null,null,null,69761.935245005632,1.5791740798093363E-3]
[null,null,null,null,null,null,null,null,"HR6","18HD06","HAH",1.571727818195731E-3,194.41015063731339,null,null,null,0.26133195926242858,0.99240557074503966,3.7974902631349026,0.26472596762485273,3.8762474671774521,3.8175952568005393,50,null,null,null,null,null,null,null,null,194.41015063731339,null,null,null,null,null,null,null,null,{"$f":"L169*Input!$E$5/Input!$E$7","v":13.097731818297758},null,null,null,null,null,null,null,null,null,85845.156517509604,1.571727818195731E-3]
[null,null,null,null,null,null,null,null,"HR6","18HD08(47)","HAH",1.981965432023051E-3,199.39157556417715,null,null,null,1.1779155158207708,2.0014483630192719,1.6991442392408456,1.6208752066459275,1.1682110080883368,4.6796144574656235,60.000000000002274,null,null,null,null,null,null,null,null,199.39157556417715,null,null,null,null,null,null,null,null,{"$f":"L170*Input!$E$5/Input!$E$7","v":16.516378600192091},null,null,null,null,null,null,null,null,null,70031.850982448581,1.981965432023051E-3]
[null,null,null,null,null,null,null,null,"HR6","18HD08(47)","18HD03(57)",1.6436970172555815E-3,188.8320539456349,null,null,null,0.43222286455889752,0.92373304289761105,2.137168388443127,0.46849994681681062,2.5078067749963386,2.13986822266902,161.00000000000136,null,null,null,null,null,null,null,null,188.8320539456349,null,null,null,null,null,null,null,null,{"$f":"L171*Input!$E$5/Input!$E$7","v":13.697475143796511},null,null,null,null,null,null,null,null,null,242290.08285748665,1.6436970172555815E-3]
[null,null,null,null,null,null,null,null,"HR6","18HD08(47)","MW125S",1.5431772361489721E-3,184.1502248945967,null,null,null,0.6672157703626751,0.55824695565180926,0.83668129628945342,1.2644712028224818,2.8403792911128098,0.88517484647917977,110.00000000000227,null,null,null,null,null,null,null,null,184.1502248945967,null,null,null,null,null,null,null,null,{"$f":"L172*Input!$E$5/Input!$E$7","v":12.859810301241435},null,null,null,null,null,null,null,null,null,89771.036841009904,1.5431772361489721E-3]
[null,null,null,null,null,null,null,null,"HR6","18HD08(47)","MW133S",1.3338567596122841E-3,168.09122118250144,null,null,null,0.23454983127216145,0.83665721271317328,3.5670765916789451,0.35883785967116233,6.5227090640716874,4.5658656332288272,251.99999999999818,null,null,null,null,null,null,null,null,168.09122118250144,null,null,null,null,null,null,null,null,{"$f":"L173*Input!$E$5/Input!$E$7","v":11.115472996769034},null,null,null,null,null,null,null,null,null,316334.76756604196,1.3338567596122841E-3]
[null,null,null,null,null,null,null,null,"HR6","18HD08(47)","MW132S",1.4813666834914124E-3,180.61950092268521,null,null,null,0.27645943010923457,0.91524612850947717,3.3105983331725937,0.30650761773542523,4.0103147146790823,3.3593422865323874,214.99999999999773,null,null,null,null,null,null,null,null,180.61950092268521,null,null,null,null,null,null,null,null,{"$f":"L174*Input!$E$5/Input!$E$7","v":12.344722362428437},null,null,null,null,null,null,null,null,null,370342.80508798477,1.4813666834914124E-3]
[null,null,null,null,null,null,null,null,"HR6","18HD09(62)","HAH",1.6850766236634327E-3,196.04726190138169,null,null,null,3.5929633612563681,4.2522855056538811,1.1835037204963217,4.4131492625025555,0.3418558682665806,6.1814145711793342,62.000000000000455,null,null,null,null,null,null,null,null,196.04726190138169,null,null,null,null,null,null,null,null,{"$f":"L175*Input!$E$5/Input!$E$7","v":14.042305197195274},null,null,null,null,null,null,null,null,null,53017.32452447684,1.6850766236634327E-3]
[null,null,null,null,null,null,null,null,"HR6","18HD09(62)","18HD03(57)",1.5277830087279582E-3,192.19832444880882,null,null,null,0.62750657833709544,0.9341065231508634,1.488600367547164,0.68980752037694004,1.7518275774420013,1.5285659058664196,162.99999999999955,null,null,null,null,null,null,null,null,192.19832444880882,null,null,null,null,null,null,null,null,{"$f":"L176*Input!$E$5/Input!$E$7","v":12.731525072732985},null,null,null,null,null,null,null,null,null,339186.45377655589,1.5277830087279582E-3]
[null,null,null,null,null,null,null,null,"HR6","18HD09(62)","MW125S",1.4476633222273217E-3,189.82464043377311,null,null,null,0.81165335015609197,0.47300967755557616,0.5827730243023207,1.7363781277653876,2.6357434471943795,0.58971637608999739,112.00000000000045,null,null,null,null,null,null,null,null,189.82464043377311,null,null,null,null,null,null,null,null,{"$f":"L177*Input!$E$5/Input!$E$7","v":12.063861018561013},null,null,null,null,null,null,null,null,null,134747.93472903452,1.4476633222273217E-3]
[null,null,null,null,null,null,null,null,"HR6","18HD09(62)","MW133S",1.2052081623883982E-3,179.81976000054732,null,null,null,0.3238559183306659,0.80464376923342007,2.4845733046380718,0.45743247756540539,4.3613738983957919,2.8237784885047077,253.99999999999636,null,null,null,null,null,null,null,null,179.81976000054732,null,null,null,null,null,null,null,null,{"$f":"L178*Input!$E$5/Input!$E$7","v":10.043401353236652},null,null,null,null,null,null,null,null,null,511492.68602511776,1.2052081623883982E-3]
[null,null,null,null,null,null,null,null,"HR6","18HD09(62)","MW132S",1.3424081899774299E-3,186.11888568920943,null,null,null,0.3990856053902897,0.92026294598243152,2.3059286868601818,0.43367997260992253,2.7229347839231361,2.3060096013396736,216.99999999999591,null,null,null,null,null,null,null,null,186.11888568920943,null,null,null,null,null,null,null,null,{"$f":"L179*Input!$E$5/Input!$E$7","v":11.186734916478583},null,null,null,null,null,null,null,null,null,539506.96689308062,1.3424081899774299E-3]
[null,null,null,null,null,null,null,null,"HR6","HAH","18HD03(57)",1.4975738386497875E-3,193.19222413471542,null,null,null,0.80267797726104073,1.0096011624464623,1.2577910333250959,0.87143176394516053,1.352541784807334,1.3786384120305184,150.99999999999909,null,null,null,null,null,null,null,null,193.19222413471542,null,null,null,null,null,null,null,null,{"$f":"L180*Input!$E$5/Input!$E$7","v":12.479781988748229},null,null,null,null,null,null,null,null,null,376073.12000755599,1.4975738386497875E-3]
[null,null,null,null,null,null,null,null,"HR6","HAH","MW125S",1.4205732763661835E-3,191.77831058724959,null,null,null,0.91134308814165688,0.44875749729844672,0.4924133437095789,2.0323632599746917,2.447020045968983,0.49278895093390335,100,null,null,null,null,null,null,null,null,191.77831058724959,null,null,null,null,null,null,null,null,{"$f":"L181*Input!$E$5/Input!$E$7","v":11.838110636384863},null,null,null,null,null,null,null,null,null,161251.71557402861,1.4205732763661835E-3]
[null,null,null,null,null,null,null,null,"HR6","HAH","MW133S",1.1673945114441284E-3,185.60734360442439,null,null,null,0.38754407559594495,0.81358566764160523,2.0993371305973803,0.4990050284111307,3.3224826182432334,2.1992231388604564,241.99999999999591,null,null,null,null,null,null,null,null,185.60734360442439,null,null,null,null,null,null,null,null,{"$f":"L182*Input!$E$5/Input!$E$7","v":9.7282875953677355},null,null,null,null,null,null,null,null,null,656751.02189658512,1.1673945114441284E-3]
[null,null,null,null,null,null,null,null,"HR6","HAH","MW132S",1.2865938773621455E-3,188.86082386749462,null,null,null,0.49887061099289431,0.97199529921000927,1.9483915824896207,0.52379209947251293,2.1046656045112,1.9884351553980988,204.99999999999545,null,null,null,null,null,null,null,null,188.86082386749462,null,null,null,null,null,null,null,null,{"$f":"L183*Input!$E$5/Input!$E$7","v":10.721615644684546},null,null,null,null,null,null,null,null,null,625672.0226795678,1.2865938773621455E-3]
[null,null,null,null,null,null,null,null,"HR6","18HD03(57)","MW125S",1.3357179131923047E-3,199.6662284213441,null,null,null,1.5304265970708617,0.59914759924270744,0.3914905820308125,6.8389235090729787,2.9198647631637669,1.0481667623525084,100.99999999999909,null,null,null,null,null,null,null,null,199.6662284213441,null,null,null,null,null,null,null,null,{"$f":"L184*Input!$E$5/Input!$E$7","v":11.130982609935874},null,null,null,null,null,null,null,null,null,75811.470662998894,1.3357179131923047E-3]
[null,null,null,null,null,null,null,null,"HR6","18HD03(57)","MW133S",1.1509016412748017E-3,211.23583367578897,null,null,null,0.88188743363006783,1.4719289495430168,1.6690667010461773,0.90413360029285872,1.1625357064170421,2.5187206034090379,191.99999999999591,null,null,null,null,null,null,null,null,211.23583367578897,null,null,null,null,null,null,null,null,{"$f":"L185*Input!$E$5/Input!$E$7","v":9.5908470106233477},null,null,null,null,null,null,null,null,null,573442.73988561181,1.1509016412748017E-3]
[null,null,null,null,null,null,null,null,"HR6","18HD03(57)","MW132S",9.9416460668754468E-4,237.80412953472279,null,null,null,1.6293527134254104,2.523962270069835,1.5490582544056253,2.9476282698645977,1.1103055141517122,7.0730741931516024,154.99999999999545,null,null,null,null,null,null,null,null,237.80412953472279,null,null,null,null,null,null,null,null,{"$f":"L186*Input!$E$5/Input!$E$7","v":8.284705055729539},null,null,null,null,null,null,null,null,null,175893.56645653149,9.9416460668754468E-4]
[null,null,null,null,null,null,null,null,"HR6","MW133S","MW132S",1.1297571655901326E-3,199.49718197041739,null,null,null,2.0602525158862819,1.9121172113092832,0.92809847169958504,2.2328314195256969,0.52603546914296284,1.9232867948719081,191.99999999999591,null,null,null,null,null,null,null,null,199.49718197041739,null,null,null,null,null,null,null,null,{"$f":"L187*Input!$E$5/Input!$E$7","v":9.4146430465844393},null,null,null,null,null,null,null,null,null,646865.69312609849,1.1297571655901326E-3]
[null,null,null,null,null,null,null,null,"HR13","HAS","18HD08(47)",2.2397464748250655E-3,166.19312400052758,null,null,null,1.0190517784976207,0.21818874623447074,0.21410957798056596,4.760531411182825,4.5841934104003803,0.21823661961891863,166.99999999999591,null,null,null,null,null,null,null,null,166.19312400052758,null,null,null,null,null,null,null,null,{"$f":"L188*Input!$E$5/Input!$E$7","v":18.664553956875547},null,null,null,null,null,null,null,null,null,146448.08312098487,2.2397464748250655E-3]
[null,null,null,null,null,null,null,null,"HR13","HAS","18HD09(62)",1.495276088787351E-3,134.2957723718655,null,null,null,1.2614398966855487,0.40469508614431965,0.32081995123799539,4.6303054619491766,2.9098896315002785,0.47657623215604139,166.99999999999591,null,null,null,null,null,null,null,null,134.2957723718655,null,null,null,null,null,null,null,null,{"$f":"L189*Input!$E$5/Input!$E$7","v":12.460634073227926},null,null,null,null,null,null,null,null,null,150566.89143603071,1.495276088787351E-3]
[null,null,null,null,null,null,null,null,"HR13","HAS","HAH",2.0248298163906327E-3,69.653487289758729,null,null,null,1.5654614386576891,0.62258671231889728,0.39770172355873334,7.5595986811132976,3.084707518493127,1.1956764812989245,166.99999999999591,null,null,null,null,null,null,null,null,69.653487289758729,null,null,null,null,null,null,null,null,{"$f":"L190*Input!$E$5/Input!$E$7","v":16.873581803255274},null,null,null,null,null,null,null,null,null,92223.242160560025,2.0248298163906327E-3]
[null,null,null,null,null,null,null,null,"HR13","HAS","18HD03(57)",2.2595466815362466E-3,166.60079740600514,null,null,null,0.94741492385392678,0.70045031003438485,0.73932792528227143,1.4144428523300567,1.5758140280882502,0.77314264012227718,277.99999999999727,null,null,null,null,null,null,null,null,166.60079740600514,null,null,null,null,null,null,null,null,{"$f":"L191*Input!$E$5/Input!$E$7","v":18.829555679468722},null,null,null,null,null,null,null,null,null,492894.21531346446,2.2595466815362466E-3]
[null,null,null,null,null,null,null,null,"HR13","HAS","MW125S",1.5433841782414722E-3,138.95255412399578,null,null,null,0.79515056119996841,0.31783238305500955,0.39971346127878732,2.9452256666108951,4.6582182973555177,0.47056121151688879,226.99999999999818,null,null,null,null,null,null,null,null,138.95255412399578,null,null,null,null,null,null,null,null,{"$f":"L192*Input!$E$5/Input!$E$7","v":12.861534818678935},null,null,null,null,null,null,null,null,null,236712.15000893432,1.5433841782414722E-3]
[null,null,null,null,null,null,null,null,"HR13","HAS","MW133S",1.6094906565096827E-3,143.86304380594336,null,null,null,0.49272579774340575,0.74254276131260522,1.5070101153893618,0.6914916975499783,2.8482385977408655,1.5704326103491268,368.99999999999409,null,null,null,null,null,null,null,null,143.86304380594336,null,null,null,null,null,null,null,null,{"$f":"L193*Input!$E$5/Input!$E$7","v":13.412422137580691},null,null,null,null,null,null,null,null,null,1008212.683210955,1.6094906565096827E-3]
[null,null,null,null,null,null,null,null,"HR13","HAS","MW132S",1.9957138613853707E-3,160.22424422836133,null,null,null,0.68989713264546193,0.86867661525901652,1.2591393327408265,0.80930694219006205,1.7003745099249192,1.28310101006438,331.99999999999363,null,null,null,null,null,null,null,null,160.22424422836133,null,null,null,null,null,null,null,null,{"$f":"L194*Input!$E$5/Input!$E$7","v":16.630948844878091},null,null,null,null,null,null,null,null,null,861441.64032295486,1.9957138613853707E-3]
[null,null,null,null,null,null,null,null,"HR13","18HD06","18HD08(47)",1.9782693168302781E-3,192.75509599011806,null,null,null,0.99282692496099934,0.59641724251159522,0.6007262973201738,1.7384627166147146,1.7636739007607394,0.62736266400869489,50,null,null,null,null,null,null,null,null,192.75509599011806,null,null,null,null,null,null,null,null,{"$f":"L195*Input!$E$5/Input!$E$7","v":16.48557764025232},null,null,null,null,null,null,null,null,null,50943.9538619901,1.9782693168302781E-3]
[null,null,null,null,null,null,null,null,"HR13","18HD06","18HD09(62)",1.7275091925609634E-3,195.04687681235282,null,null,null,0.64293339609540301,0.57871921462542719,0.90012312027971364,1.1805508927383754,2.8559640992735864,0.95650787057462117,51.999999999998181,null,null,null,null,null,null,null,null,195.04687681235282,null,null,null,null,null,null,null,null,{"$f":"L196*Input!$E$5/Input!$E$7","v":14.395909938008028},null,null,null,null,null,null,null,null,null,75019.353228033084,1.7275091925609634E-3]
[null,null,null,null,null,null,null,null,"HR13","18HD06","HAH",1.7211009887458271E-3,195.11461677150353,null,null,null,0.51589981085622194,0.57565647012499088,1.1158299693298837,1.2185929840837284,4.5785497347433335,1.5172415124735135,39.999999999997726,null,null,null,null,null,null,null,null,195.11461677150353,null,null,null,null,null,null,null,null,{"$f":"L197*Input!$E$5/Input!$E$7","v":14.342508239548559},null,null,null,null,null,null,null,null,null,72677.395638054018,1.7211009887458271E-3]
[null,null,null,null,null,null,null,null,"HR13","18HD06","18HD03(57)",1.3774291455545219E-3,199.73607560705227,null,null,null,0.34852499994164388,0.72295554761121872,2.0743290947055981,0.68087021493068856,5.6052690653482173,2.9296764079873134,132.99999999999272,null,null,null,null,null,null,null,null,199.73607560705227,null,null,null,null,null,null,null,null,{"$f":"L198*Input!$E$5/Input!$E$7","v":11.47857621295435},null,null,null,null,null,null,null,null,null,130074.95772894939,1.3774291455545219E-3]
[null,null,null,null,null,null,null,null,"HR13","18HD06","MW125S",1.4105833563530313E-3,199.18477264135242,null,null,null,0.68943219296655078,0.77318048115526683,1.121474292966153,0.89378833658220247,1.8804057274001724,1.1241216932147824,81.999999999993634,null,null,null,null,null,null,null,null,199.18477264135242,null,null,null,null,null,null,null,null,{"$f":"L199*Input!$E$5/Input!$E$7","v":11.754861302941928},null,null,null,null,null,null,null,null,null,99088.521074994656,1.4105833563530313E-3]
[null,null,null,null,null,null,null,null,"HR13","18HD06","MW133S",1.1743840247776824E-3,203.86394371505992,null,null,null,0.22046071724008162,0.9321545674909959,4.2282116250029249,0.24141830915659587,4.9671556808569663,4.3160218609139394,223.99999999998954,null,null,null,null,null,null,null,null,203.86394371505992,null,null,null,null,null,null,null,null,{"$f":"L200*Input!$E$5/Input!$E$7","v":9.7865335398140196},null,null,null,null,null,null,null,null,null,366849.41061600629,1.1743840247776824E-3]
[null,null,null,null,null,null,null,null,"HR13","18HD06","MW132S",1.1325647741761413E-3,204.92044562496127,null,null,null,0.23617833992564807,0.83436178535794325,3.5327616648529703,0.36426962736773932,6.5304458121579527,4.5462324717015772,186.99999999998909,null,null,null,null,null,null,null,null,204.92044562496127,null,null,null,null,null,null,null,null,{"$f":"L201*Input!$E$5/Input!$E$7","v":9.4380397848011786},null,null,null,null,null,null,null,null,null,243128.05068593394,1.1325647741761413E-3]
[null,null,null,null,null,null,null,null,"HR13","18HD08(47)","18HD09(62)",2.0108385271605839E-3,204.61351106409006,null,null,null,1.0930241087333832,1.637777929288273,1.498391404363588,1.1212743376289089,0.93853916462675691,2.5174591300318161,51.999999999998181,null,null,null,null,null,null,null,null,204.61351106409006,null,null,null,null,null,null,null,null,{"$f":"L202*Input!$E$5/Input!$E$7","v":16.756987726338203},null,null,null,null,null,null,null,null,null,28503.581628006166,2.0108385271605839E-3]
[null,null,null,null,null,null,null,null,"HR13","18HD08(47)","HAH",1.9857860856276372E-3,199.37771736811129,null,null,null,0.6250247413296881,1.1609635553820514,1.8574681586399253,0.6253917526000905,1.6008761391736428,2.1577190953300192,50,null,null,null,null,null,null,null,null,199.37771736811129,null,null,null,null,null,null,null,null,{"$f":"L203*Input!$E$5/Input!$E$7","v":16.548217380230309},null,null,null,null,null,null,null,null,null,51104.502860995235,1.9857860856276372E-3]
[null,null,null,null,null,null,null,null,"HR13","18HD09(62)","HAH",1.7352600454965707E-3,195.38052716695523,null,null,null,1.989759139806262,2.4665879921559384,1.2396414936915952,2.0743611139123335,0.52394215974868352,3.187693609930331,51.999999999998181,null,null,null,null,null,null,null,null,195.38052716695523,null,null,null,null,null,null,null,null,{"$f":"L204*Input!$E$5/Input!$E$7","v":14.460500379138089},null,null,null,null,null,null,null,null,null,34592.145661993847,1.7352600454965707E-3]
[null,null,null,null,null,null,null,null,"HR13","18HD09(62)","18HD03(57)",1.5677489904830837E-3,186.55226119423503,null,null,null,0.3475089568122372,0.8008326011695055,2.3044948496167939,0.47999045750278718,3.9746656173245025,2.5490836484102957,162.99999999999955,null,null,null,null,null,null,null,null,186.55226119423503,null,null,null,null,null,null,null,null,{"$f":"L205*Input!$E$5/Input!$E$7","v":13.064574920692365},null,null,null,null,null,null,null,null,null,149495.8924420171,1.5677489904830837E-3]
[null,null,null,null,null,null,null,null,"HR13","18HD09(62)","MW132S",1.4494824425038716E-3,176.40206993128282,null,null,null,0.22101094585411335,0.86741355647400742,3.924753831181631,0.29794720247565137,6.0997459258041005,4.5894871285047429,216.99999999999591,null,null,null,null,null,null,null,null,176.40206993128282,null,null,null,null,null,null,null,null,{"$f":"L206*Input!$E$5/Input!$E$7","v":12.079020354198931},null,null,null,null,null,null,null,null,null,240836.63552402472,1.4494824425038716E-3]
[null,null,null,null,null,null,null,null,"HR13","HAH","18HD03(57)",1.5015582687830621E-3,190.21853720078076,null,null,null,0.46560275824556879,0.86555602067578763,1.8590010590514476,0.53840329963805089,2.4835712511345722,1.8606598535487304,150.99999999999909,null,null,null,null,null,null,null,null,190.21853720078076,null,null,null,null,null,null,null,null,{"$f":"L207*Input!$E$5/Input!$E$7","v":12.512985573192184},null,null,null,null,null,null,null,null,null,204807.73753549988,1.5015582687830621E-3]
[null,null,null,null,null,null,null,null,"HR13","HAH","MW125S",1.2907645339835273E-3,183.48592062354541,null,null,null,0.52863522803341423,0.53130928088605944,1.0050584083519991,1.5905278803522134,5.6915307204035779,1.6066596570046101,100,null,null,null,null,null,null,null,null,183.48592062354541,null,null,null,null,null,null,null,null,{"$f":"L208*Input!$E$5/Input!$E$7","v":10.756371116529396},null,null,null,null,null,null,null,null,null,69328.656883460935,1.2907645339835273E-3]
[null,null,null,null,null,null,null,null,"HR13","HAH","MW133S",1.1586191335621881E-3,177.45725527908297,null,null,null,0.2247994783099915,0.85183208339145577,3.7892974209522219,0.32523963783627091,6.4359531010380699,4.6700427627006116,241.99999999999591,null,null,null,null,null,null,null,null,177.45725527908297,null,null,null,null,null,null,null,null,{"$f":"L209*Input!$E$5/Input!$E$7","v":9.6551594463515666},null,null,null,null,null,null,null,null,null,339039.73824994755,1.1586191335621881E-3]
[null,null,null,null,null,null,null,null,"HR13","HAH","MW132S",1.3111316872800845E-3,184.26299428093856,null,null,null,0.28937573854776993,0.91617499438021144,3.1660394163589145,0.31922577889002252,3.812182836787275,3.1998571456133109,204.99999999999545,null,null,null,null,null,null,null,null,184.26299428093856,null,null,null,null,null,null,null,null,{"$f":"L210*Input!$E$5/Input!$E$7","v":10.926097394000704},null,null,null,null,null,null,null,null,null,345426.87017299503,1.3111316872800845E-3]
[null,null,null,null,null,null,null,null,"HR13","18HD03(57)","MW125S",1.3963384401273519E-3,197.94124294876502,null,null,null,1.3120725337588817,0.70936459449622136,0.5406443441537514,2.4561277169717921,1.426708528947477,0.71791706086069929,111.00000000000136,null,null,null,null,null,null,null,null,197.94124294876502,null,null,null,null,null,null,null,null,{"$f":"L211*Input!$E$5/Input!$E$7","v":11.636153667727934},null,null,null,null,null,null,null,null,null,155153.7944444876,1.3963384401273519E-3]
[null,null,null,null,null,null,null,null,"HR13","18HD03(57)","MW133S",1.2783766851064378E-3,216.393192154921,null,null,null,0.75606388555173853,1.5411238835216992,2.0383514051819338,0.8924598507071001,1.5612472980246033,3.7080604171722999,201.99999999999818,null,null,null,null,null,null,null,null,216.393192154921,null,null,null,null,null,null,null,null,{"$f":"L212*Input!$E$5/Input!$E$7","v":10.653139042553649},null,null,null,null,null,null,null,null,null,426996.83871103061,1.2783766851064378E-3]
[null,null,null,null,null,null,null,null,"HR13","MW125S","MW132S",1.2981233290547973E-3,185.18744262349875,null,null,null,0.39806387643578428,1.2539429674448639,3.1501048994259846,0.46599772703971776,2.9408864913513115,4.6241704139120703,164.99999999999773,null,null,null,null,null,null,null,null,185.18744262349875,null,null,null,null,null,null,null,null,{"$f":"L213*Input!$E$5/Input!$E$7","v":10.817694408789977},null,null,null,null,null,null,null,null,null,239030.2562129834,1.2981233290547973E-3]
[null,null,null,null,null,null,null,null,"HR13","MW133S","MW132S",1.1566290434196246E-3,200.07172496430289,null,null,null,2.1571043624787585,1.8023070448482559,0.83552148713713603,2.5981805282596557,0.5583763421934872,1.8137798379894969,201.99999999999818,null,null,null,null,null,null,null,null,200.07172496430289,null,null,null,null,null,null,null,null,{"$f":"L214*Input!$E$5/Input!$E$7","v":9.6385753618302044},null,null,null,null,null,null,null,null,null,609399.56198603427,1.1566290434196246E-3]
[null,null,null,null,null,null,null,null,"HAS","18HD06","18HD03(57)",2.3369438987704875E-3,174.76266150159509,null,null,null,1.2961354057220422,1.0321296703769454,0.79631315202131492,1.6567908053806786,0.98620438096463436,1.0505952986181746,277.99999999999727,null,null,null,null,null,null,null,null,174.76266150159509,null,null,null,null,null,null,null,null,{"$f":"L215*Input!$E$5/Input!$E$7","v":19.474532489754065},null,null,null,null,null,null,null,null,null,739304.29716951645,2.3369438987704875E-3]
[null,null,null,null,null,null,null,null,"HAS","18HD06","MW125S",1.9672002208559265E-3,170.02257102178004,null,null,null,2.5639408228912108,2.4326674133184434,0.94880014062698304,2.7090811541633841,0.41210323208775373,2.4387736606063779,226.99999999999818,null,null,null,null,null,null,null,null,170.02257102178004,null,null,null,null,null,null,null,null,{"$f":"L216*Input!$E$5/Input!$E$7","v":16.39333517379939},null,null,null,null,null,null,null,null,null,452135.7952110311,1.9672002208559265E-3]
[null,null,null,null,null,null,null,null,"HAS","18HD06","MW133S",1.5397653892068963E-3,161.12837416649353,null,null,null,0.81987501967890497,1.2553547297979319,1.531153773034307,0.82129197183912639,1.2218060433692264,1.9254630788387161,368.99999999999409,null,null,null,null,null,null,null,null,161.12837416649353,null,null,null,null,null,null,null,null,{"$f":"L217*Input!$E$5/Input!$E$7","v":12.831378243390803},null,null,null,null,null,null,null,null,null,1491397.2179540629,1.5397653892068963E-3]
[null,null,null,null,null,null,null,null,"HAS","18HD06","MW132S",1.9448362378693658E-3,169.67027153585303,null,null,null,0.87832754750317499,0.96049757838727878,1.0935528335843374,1.0032498412191508,1.3004572844142916,1.199744147810498,331.99999999999363,null,null,null,null,null,null,null,null,169.67027153585303,null,null,null,null,null,null,null,null,{"$f":"L218*Input!$E$5/Input!$E$7","v":16.206968648911385},null,null,null,null,null,null,null,null,null,1220904.815135991,1.9448362378693658E-3]
[null,null,null,null,null,null,null,null,"HAS","18HD08(47)","18HD03(57)",2.2584850530507879E-3,166.43296195218048,null,null,null,1.0511349030960802,1.1306143332465988,1.0756129683415656,1.1432134784419243,1.0346904051994061,1.3226331259546265,277.99999999999727,null,null,null,null,null,null,null,null,166.43296195218048,null,null,null,null,null,null,null,null,{"$f":"L219*Input!$E$5/Input!$E$7","v":18.820708775423235},null,null,null,null,null,null,null,null,null,587244.94617047207,2.2584850530507879E-3]
[null,null,null,null,null,null,null,null,"HAS","18HD08(47)","MW125S",1.6909188046188117E-3,156.32392714467696,null,null,null,1.6226207395115224,2.0795238425424469,1.2815834235968606,1.6607633998724394,0.63077390742753536,2.7277309296750718,226.99999999999818,null,null,null,null,null,null,null,null,156.32392714467696,null,null,null,null,null,null,null,null,{"$f":"L220*Input!$E$5/Input!$E$7","v":14.090990038490098},null,null,null,null,null,null,null,null,null,404239.60310092999,1.6909188046188117E-3]
[null,null,null,null,null,null,null,null,"HAS","18HD08(47)","MW133S",1.5559050241927593E-3,152.52628491085287,null,null,null,0.57040831103896805,1.1797141665734177,2.0681924574777528,0.57137578456627969,1.7561036324525745,2.4440142319418183,368.99999999999409,null,null,null,null,null,null,null,null,152.52628491085287,null,null,null,null,null,null,null,null,{"$f":"L221*Input!$E$5/Input!$E$7","v":12.965875201606329},null,null,null,null,null,null,null,null,null,1174964.6305339874,1.5559050241927593E-3]
[null,null,null,null,null,null,null,null,"HAS","18HD08(47)","MW132S",1.9795181930601052E-3,162.31999188358384,null,null,null,0.67232943952290447,0.99310241869669702,1.4771068472048734,0.71669949827363066,1.5855240861033875,1.5637269574082699,331.99999999999363,null,null,null,null,null,null,null,null,162.31999188358384,null,null,null,null,null,null,null,null,{"$f":"L222*Input!$E$5/Input!$E$7","v":16.495984942167546},null,null,null,null,null,null,null,null,null,936719.41898398101,1.9795181930601052E-3]
[null,null,null,null,null,null,null,null,"HAS","18HD09(62)","18HD03(57)",2.2310416237667397E-3,156.12936379772157,null,null,null,0.85869329455685761,1.1433110810247096,1.3314545347820999,0.88697143755594343,1.2029109872717838,1.5723974003785404,277.99999999999727,null,null,null,null,null,null,null,null,156.12936379772157,null,null,null,null,null,null,null,null,{"$f":"L223*Input!$E$5/Input!$E$7","v":18.592013531389497},null,null,null,null,null,null,null,null,null,493965.21430747851,2.2310416237667397E-3]
[null,null,null,null,null,null,null,null,"HAS","18HD09(62)","MW125S",1.5353623932271927E-3,136.39668395210469,null,null,null,1.1106836379797107,1.7620067467840344,1.5864164074560911,1.2073793759728912,0.97873023525353686,3.0386322225071272,226.99999999999818,null,null,null,null,null,null,null,null,136.39668395210469,null,null,null,null,null,null,null,null,{"$f":"L224*Input!$E$5/Input!$E$7","v":12.794686610226607},null,null,null,null,null,null,null,null,null,362879.34426898073,1.5353623932271927E-3]
[null,null,null,null,null,null,null,null,"HAS","18HD09(62)","MW133S",1.6372423947026871E-3,140.91952820291922,null,null,null,0.44317129903251012,1.1345741591486451,2.5601255352626415,0.44551823559310272,2.2684135448733809,2.9200346684373555,368.99999999999409,null,null,null,null,null,null,null,null,140.91952820291922,null,null,null,null,null,null,null,null,{"$f":"L225*Input!$E$5/Input!$E$7","v":13.643686622522393},null,null,null,null,null,null,null,null,null,983423.3511309874,1.6372423947026871E-3]
[null,null,null,null,null,null,null,null,"HAS","18HD09(62)","MW132S",2.0727265397847221E-3,153.19155295876163,null,null,null,0.54611719642995094,0.99854599656210097,1.8284463538041726,0.56813926749146426,1.9049479026585916,1.8994123283595081,331.99999999999363,null,null,null,null,null,null,null,null,153.19155295876163,null,null,null,null,null,null,null,null,{"$f":"L226*Input!$E$5/Input!$E$7","v":17.272721164872685},null,null,null,null,null,null,null,null,null,771171.89623496041,2.0727265397847221E-3]
[null,null,null,null,null,null,null,null,"HAS","HAH","18HD03(57)",2.2775812176490263E-3,145.73119532420986,null,null,null,0.7478520646728497,1.2357136663031782,1.6523504108312455,0.74802644675628338,1.3374746483873832,2.0423080929408255,277.99999999999727,null,null,null,null,null,null,null,null,145.73119532420986,null,null,null,null,null,null,null,null,{"$f":"L227*Input!$E$5/Input!$E$7","v":18.979843480408555},null,null,null,null,null,null,null,null,null,380309.71993852471,2.2775812176490263E-3]
[null,null,null,null,null,null,null,null,"HAS","HAH","MW125S",1.685547921260517E-3,106.09033256746559,null,null,null,0.84909494143305808,1.6716650323013242,1.9687610309866825,1.095817980835712,1.5199381480676319,4.2474124069357515,226.99999999999818,null,null,null,null,null,null,null,null,106.09033256746559,null,null,null,null,null,null,null,null,{"$f":"L228*Input!$E$5/Input!$E$7","v":14.046232677170977},null,null,null,null,null,null,null,null,null,259606.73528603298,1.685547921260517E-3]
[null,null,null,null,null,null,null,null,"HAS","HAH","MW133S",1.8435075951459025E-3,127.43185277333228,null,null,null,0.36107336353630082,1.1471825297786999,3.1771452719285591,0.37363166940455217,2.8658455238842602,3.771532255643975,368.99999999999409,null,null,null,null,null,null,null,null,127.43185277333228,null,null,null,null,null,null,null,null,{"$f":"L229*Input!$E$5/Input!$E$7","v":15.362563292882523},null,null,null,null,null,null,null,null,null,761396.18712156697,1.8435075951459025E-3]
[null,null,null,null,null,null,null,null,"HAS","HAH","MW132S",2.2286193845846613E-3,144.33049651142952,null,null,null,0.46479587954898055,1.0546790120590874,2.2691229816462788,0.46771448465022475,2.1649919261645305,2.4082240460914526,331.99999999999363,null,null,null,null,null,null,null,null,144.33049651142952,null,null,null,null,null,null,null,null,{"$f":"L230*Input!$E$5/Input!$E$7","v":18.571828204872176},null,null,null,null,null,null,null,null,null,608238.01231051993,2.2286193845846613E-3]
[null,null,null,null,null,null,null,null,"HAS","18HD03(57)","MW125S",2.4679350590534697E-3,182.74186934241328,null,null,null,1.8731843143798059,2.2318826913664314,1.1914912345960933,1.8882613816564093,0.53814720157775553,2.6806728425058357,277.99999999999727,null,null,null,null,null,null,null,null,182.74186934241328,null,null,null,null,null,null,null,null,{"$f":"L231*Input!$E$5/Input!$E$7","v":20.566125492112249},null,null,null,null,null,null,null,null,null,411335.85974901798,2.4679350590534697E-3]
[null,null,null,null,null,null,null,null,"HAS","18HD03(57)","MW132S",2.3396430723615124E-3,139.83203434442754,null,null,null,1.9942661420169612,2.7386655425547692,1.3732698383902446,2.5750100295241332,0.64745962728045237,4.8561342906375184,331.99999999999363,null,null,null,null,null,null,null,null,139.83203434442754,null,null,null,null,null,null,null,null,{"$f":"L232*Input!$E$5/Input!$E$7","v":19.497025603012602},null,null,null,null,null,null,null,null,null,301633.62858747592,2.3396430723615124E-3]
[null,null,null,null,null,null,null,null,"HAS","MW125S","MW133S",1.5876183224188766E-3,146.68579222358636,null,null,null,1.1159691863664025,1.8009276739417341,1.6137790325605295,1.2476290158424383,1.0018000754129248,3.2491787442351621,368.99999999999409,null,null,null,null,null,null,null,null,146.68579222358636,null,null,null,null,null,null,null,null,{"$f":"L233*Input!$E$5/Input!$E$7","v":13.230152686823972},null,null,null,null,null,null,null,null,null,883801.87890503113,1.5876183224188766E-3]
[null,null,null,null,null,null,null,null,"HAS","MW125S","MW132S",1.9459444151788557E-3,169.24341942287143,null,null,null,1.2524333505906113,1.4435095240487981,1.1525639455130134,1.2765782068584846,0.81383840164752208,1.6958111475819619,331.99999999999363,null,null,null,null,null,null,null,null,169.24341942287143,null,null,null,null,null,null,null,null,{"$f":"L234*Input!$E$5/Input!$E$7","v":16.216203459823799},null,null,null,null,null,null,null,null,null,863759.74652700394,1.9459444151788557E-3]
[null,null,null,null,null,null,null,null,"HAS","MW133S","MW132S",2.4839045296895096E-3,212.48499172220812,null,null,null,2.9050237573733919,2.0747732967473236,0.71420183448800834,6.2072054802242072,0.73552382594028709,3.1661978164443165,368.99999999999409,null,null,null,null,null,null,null,null,212.48499172220812,null,null,null,null,null,null,null,null,{"$f":"L235*Input!$E$5/Input!$E$7","v":20.699204414079247},null,null,null,null,null,null,null,null,null,462628.51909803395,2.4839045296895096E-3]
[null,null,null,null,null,null,null,null,"18HD06","18HD08(47)","18HD03(57)",1.6469248785340948E-3,188.61537400408477,null,null,null,0.38453919552026833,1.0954188855298441,2.8486533968215646,0.38542365231054732,2.6064964376856534,3.1276459423196927,161.00000000000136,null,null,null,null,null,null,null,null,188.61537400408477,null,null,null,null,null,null,null,null,{"$f":"L236*Input!$E$5/Input!$E$7","v":13.724373987784125},null,null,null,null,null,null,null,null,null,233116.26385491667,1.6469248785340948E-3]
[null,null,null,null,null,null,null,null,"18HD06","18HD08(47)","MW125S",1.5498623310603065E-3,187.03462852736212,null,null,null,0.59360722583600656,0.85483277786244216,1.4400646431797368,0.69675345817891698,1.9773373743285259,1.4449176900253586,110.00000000000227,null,null,null,null,null,null,null,null,187.03462852736212,null,null,null,null,null,null,null,null,{"$f":"L237*Input!$E$5/Input!$E$7","v":12.915519425502556},null,null,null,null,null,null,null,null,null,128953.10496597392,1.5498623310603065E-3]
[null,null,null,null,null,null,null,null,"18HD06","18HD08(47)","MW133S",1.2563602540729053E-3,180.5418254280128,null,null,null,0.2086738366302259,0.93974566596272768,4.5034187377691017,0.22603998788792123,5.190979017688746,4.5842673396286058,251.99999999999818,null,null,null,null,null,null,null,null,180.5418254280128,null,null,null,null,null,null,null,null,{"$f":"L238*Input!$E$5/Input!$E$7","v":10.469668783940877},null,null,null,null,null,null,null,null,null,397489.50027594826,1.2563602540729053E-3]
[null,null,null,null,null,null,null,null,"18HD06","18HD08(47)","MW132S",1.4218763773992469E-3,184.57945419555676,null,null,null,0.2459598868206346,1.0339457808567964,4.2037170947748805,0.24599702611674185,4.0663175215219081,4.3470718513769357,214.99999999999773,null,null,null,null,null,null,null,null,184.57945419555676,null,null,null,null,null,null,null,null,{"$f":"L239*Input!$E$5/Input!$E$7","v":11.848969811660391},null,null,null,null,null,null,null,null,null,365242.30900788272,1.4218763773992469E-3]
[null,null,null,null,null,null,null,null,"18HD06","18HD09(62)","18HD03(57)",1.5238326977234931E-3,192.92846602811076,null,null,null,0.60047938279906676,1.1077203900234354,1.8447267662378715,0.60422588530710442,1.6757264524646605,2.0561908641174118,162.99999999999955,null,null,null,null,null,null,null,null,192.92846602811076,null,null,null,null,null,null,null,null,{"$f":"L240*Input!$E$5/Input!$E$7","v":12.698605814362443},null,null,null,null,null,null,null,null,null,354590.20339899918,1.5238326977234931E-3]
[null,null,null,null,null,null,null,null,"18HD06","18HD09(62)","MW125S",1.4773362695017413E-3,192.35889998211917,null,null,null,0.77669481018046738,0.72431058069728105,0.93255493818606205,1.0793169145824717,1.7891558661407521,0.93863735856913111,112.00000000000045,null,null,null,null,null,null,null,null,192.35889998211917,null,null,null,null,null,null,null,null,{"$f":"L241*Input!$E$5/Input!$E$7","v":12.311135579181178},null,null,null,null,null,null,null,null,null,198507.57147901185,1.4773362695017413E-3]
[null,null,null,null,null,null,null,null,"18HD06","18HD09(62)","MW133S",1.2061296277811669E-3,188.09931330566192,null,null,null,0.30990719247974952,0.9037876961926703,2.9163172656979466,0.34712233619441873,3.6142588128063537,2.9522429766723128,253.99999999999636,null,null,null,null,null,null,null,null,188.09931330566192,null,null,null,null,null,null,null,null,{"$f":"L242*Input!$E$5/Input!$E$7","v":10.051080231509724},null,null,null,null,null,null,null,null,null,617224.9873600367,1.2061296277811669E-3]
[null,null,null,null,null,null,null,null,"18HD06","18HD09(62)","MW132S",1.313940781367425E-3,190.01764266628675,null,null,null,0.38189667850783465,1.0396132369627702,2.7222369176521717,0.38328926132738644,2.6280576593904663,2.8403933715467224,216.99999999999591,null,null,null,null,null,null,null,null,190.01764266628675,null,null,null,null,null,null,null,null,{"$f":"L243*Input!$E$5/Input!$E$7","v":10.949506511395208},null,null,null,null,null,null,null,null,null,558984.0394379918,1.313940781367425E-3]
[null,null,null,null,null,null,null,null,"18HD06","HAH","18HD03(57)",1.4971892700232287E-3,194.0054940011234,null,null,null,0.8088205073843322,1.1972465299363808,1.4802376040243967,0.81646137084617221,1.2480481291156718,1.788951256537465,150.99999999999909,null,null,null,null,null,null,null,null,194.0054940011234,null,null,null,null,null,null,null,null,{"$f":"L244*Input!$E$5/Input!$E$7","v":12.476577250193573},null,null,null,null,null,null,null,null,null,407560.09090250346,1.4971892700232287E-3]
[null,null,null,null,null,null,null,null,"18HD06","HAH","MW125S",1.4610406275341764E-3,193.79421422546352,null,null,null,0.91831718302172982,0.68717368562148706,0.74829666516784177,1.3801931149115905,1.6366448011264954,0.77283623504884236,100,null,null,null,null,null,null,null,null,193.79421422546352,null,null,null,null,null,null,null,null,{"$f":"L245*Input!$E$5/Input!$E$7","v":12.175338562784804},null,null,null,null,null,null,null,null,null,241094.57359650978,1.4610406275341764E-3]
[null,null,null,null,null,null,null,null,"18HD06","HAH","MW133S",1.1903382097955759E-3,191.79788980562461,null,null,null,0.39050977445138652,0.91383136777869622,2.3400985777180758,0.42739708361400752,2.8026427158579907,2.3404526521508453,241.99999999999591,null,null,null,null,null,null,null,null,191.79788980562461,null,null,null,null,null,null,null,null,{"$f":"L246*Input!$E$5/Input!$E$7","v":9.9194850816297979},null,null,null,null,null,null,null,null,null,778566.54450400837,1.1903382097955759E-3]
[null,null,null,null,null,null,null,null,"18HD06","HAH","MW132S",1.2735259934853857E-3,192.50306535149491,null,null,null,0.50268824127858491,1.0980548371917227,2.1843654715272947,0.5032377610993044,1.9914791715184501,2.4011750799347498,204.99999999999545,null,null,null,null,null,null,null,null,192.50306535149491,null,null,null,null,null,null,null,null,{"$f":"L247*Input!$E$5/Input!$E$7","v":10.612716612378215},null,null,null,null,null,null,null,null,null,661232.31649698329,1.2735259934853857E-3]
[null,null,null,null,null,null,null,null,"18HD06","18HD03(57)","MW125S",1.4281089707161674E-3,197.1081190204211,null,null,null,1.8148730417716779,0.91746314319304412,0.50552469626052587,5.8719549945206797,1.7827490716677814,1.5006087418189289,132.99999999999272,null,null,null,null,null,null,null,null,197.1081190204211,null,null,null,null,null,null,null,null,{"$f":"L248*Input!$E$5/Input!$E$7","v":11.900908089301394},null,null,null,null,null,null,null,null,null,124167.35779053309,1.4281089707161674E-3]
[null,null,null,null,null,null,null,null,"18HD06","18HD03(57)","MW133S",1.1990408300181093E-3,213.36072208883098,null,null,null,1.0457958142100381,1.6532922084690482,1.5808938857896406,1.0984282477465575,1.0043333737704003,2.7452198626626685,223.99999999998954,null,null,null,null,null,null,null,null,213.36072208883098,null,null,null,null,null,null,null,null,{"$f":"L249*Input!$E$5/Input!$E$7","v":9.9920069168175782},null,null,null,null,null,null,null,null,null,663771.29159808799,1.1990408300181093E-3]
[null,null,null,null,null,null,null,null,"18HD06","MW133S","MW132S",1.1735731017940799E-3,200.4192943121364,null,null,null,2.3141058765445512,2.1601025795723157,0.93345019407573726,2.4855355774021195,0.46414484730121175,2.1657198873418215,223.99999999998954,null,null,null,null,null,null,null,null,200.4192943121364,null,null,null,null,null,null,null,null,{"$f":"L250*Input!$E$5/Input!$E$7","v":9.7797758482839985},null,null,null,null,null,null,null,null,null,733120.92191610707,1.1735731017940799E-3]
[null,null,null,null,null,null,null,null,"18HD08(47)","18HD09(62)","HAH",1.2934468556183771E-3,203.24496721752007,null,null,null,1.2149138807060056,2.124604153783475,1.748769346967074,2.2309421234174862,1.5114622877582482,6.8226543268266306,12.000000000000455,null,null,null,null,null,null,null,null,203.24496721752007,null,null,null,null,null,null,null,null,{"$f":"L251*Input!$E$5/Input!$E$7","v":10.77872379681981},null,null,null,null,null,null,null,null,null,11991.224429004747,1.2934468556183771E-3]
[null,null,null,null,null,null,null,null,"18HD08(47)","18HD09(62)","18HD03(57)",1.495247314899873E-3,203.76289499642678,null,null,null,0.21218319687776818,1.0112299547288168,4.7658342866393584,0.21248035621854669,4.7195088938683298,4.8261038224635477,162.99999999999955,null,null,null,null,null,null,null,null,203.76289499642678,null,null,null,null,null,null,null,null,{"$f":"L252*Input!$E$5/Input!$E$7","v":12.460394290832275},null,null,null,null,null,null,null,null,null,125902.12180604588,1.495247314899873E-3]
[null,null,null,null,null,null,null,null,"18HD08(47)","18HD09(62)","MW125S",1.6789065133721714E-3,204.12587726778449,null,null,null,0.2744500353272063,0.84731259663259595,3.0873109403043375,0.36159461891365735,4.8005984087587628,3.4465350755471902,112.00000000000045,null,null,null,null,null,null,null,null,204.12587726778449,null,null,null,null,null,null,null,null,{"$f":"L253*Input!$E$5/Input!$E$7","v":13.990887611434761},null,null,null,null,null,null,null,null,null,73982.6487750011,1.6789065133721714E-3]
[null,null,null,null,null,null,null,null,"18HD08(47)","HAH","18HD03(57)",1.5084182680535267E-3,201.65906230927487,null,null,null,0.40104855668130568,1.0929577221569295,2.7252503567179063,0.40140335175762681,2.495669544132427,2.9812184814946607,161.00000000000136,null,null,null,null,null,null,null,null,201.65906230927487,null,null,null,null,null,null,null,null,{"$f":"L254*Input!$E$5/Input!$E$7","v":12.570152233779391},null,null,null,null,null,null,null,null,null,203814.8881325179,1.5084182680535267E-3]
[null,null,null,null,null,null,null,null,"18HD08(47)","HAH","MW125S",1.6413431088008199E-3,200.88900148430957,null,null,null,0.45534179396307595,0.80386913489653944,1.7654191764389759,0.57812533914130504,2.7883480088294204,1.8018460591271606,110.00000000000227,null,null,null,null,null,null,null,null,200.88900148430957,null,null,null,null,null,null,null,null,{"$f":"L255*Input!$E$5/Input!$E$7","v":13.677859240006834},null,null,null,null,null,null,null,null,null,141512.52971546713,1.6413431088008199E-3]
[null,null,null,null,null,null,null,null,"18HD08(47)","HAH","MW132S",1.2658240720167129E-3,203.48852768112806,null,null,null,0.24925479977925905,1.0620042728757026,4.2607174418154337,0.25144981110695852,4.0472893441429374,4.5647477346600152,214.99999999999773,null,null,null,null,null,null,null,null,203.48852768112806,null,null,null,null,null,null,null,null,{"$f":"L256*Input!$E$5/Input!$E$7","v":10.548533933472608},null,null,null,null,null,null,null,null,null,325361.06857403164,1.2658240720167129E-3]
[null,null,null,null,null,null,null,null,"18HD08(47)","18HD03(57)","MW125S",1.5806756896054306E-3,193.65447325190613,null,null,null,1.6567845102413405,1.0732662187886768,0.64780073217387579,2.6611279129078693,0.96946849265554869,1.1167311215910263,161.00000000000136,null,null,null,null,null,null,null,null,193.65447325190613,null,null,null,null,null,null,null,null,{"$f":"L257*Input!$E$5/Input!$E$7","v":13.172297413378589},null,null,null,null,null,null,null,null,null,228330.5166794759,1.5806756896054306E-3]
[null,null,null,null,null,null,null,null,"18HD08(47)","18HD03(57)","MW133S",1.4681107181241046E-3,221.98612563306853,null,null,null,0.95469945609363516,1.7592975081990123,1.8427762757900468,1.2166981929655409,1.3349023965788007,4.1316934142895132,251.99999999999818,null,null,null,null,null,null,null,null,221.98612563306853,null,null,null,null,null,null,null,null,{"$f":"L258*Input!$E$5/Input!$E$7","v":12.23425598436754},null,null,null,null,null,null,null,null,null,499398.05517705576,1.4681107181241046E-3]
[null,null,null,null,null,null,null,null,"18HD08(47)","MW125S","MW132S",1.5432263264137935E-3,177.19132945410564,null,null,null,0.60226929115627437,1.4535354026659155,2.4134310415783067,0.76969285005971766,2.1219542341564952,4.4831909914763299,214.99999999999773,null,null,null,null,null,null,null,null,177.19132945410564,null,null,null,null,null,null,null,null,{"$f":"L259*Input!$E$5/Input!$E$7","v":12.860219386781614},null,null,null,null,null,null,null,null,null,331279.9306439528,1.5432263264137935E-3]
[null,null,null,null,null,null,null,null,"18HD08(47)","MW133S","MW132S",1.2709635944072541E-3,202.22358481910834,null,null,null,2.4624810311562895,2.0891836105586798,0.84840597110211136,2.9439820119612818,0.48550014571305244,2.1190567370054443,251.99999999999818,null,null,null,null,null,null,null,null,202.22358481910834,null,null,null,null,null,null,null,null,{"$f":"L260*Input!$E$5/Input!$E$7","v":10.591363286727116},null,null,null,null,null,null,null,null,null,700873.73064804205,1.2709635944072541E-3]
[null,null,null,null,null,null,null,null,"18HD09(62)","HAH","18HD03(57)",1.5012679724737759E-3,198.9064779592571,null,null,null,0.18876389560244536,1.0808201606824728,5.7257780002526681,0.20159598429597014,5.6577533953585606,6.6092303425844419,162.99999999999955,null,null,null,null,null,null,null,null,198.9064779592571,null,null,null,null,null,null,null,null,{"$f":"L261*Input!$E$5/Input!$E$7","v":12.510566437281467},null,null,null,null,null,null,null,null,null,89903.990755476625,1.5012679724737759E-3]
[null,null,null,null,null,null,null,null,"18HD09(62)","HAH","MW125S",1.5583266394297822E-3,197.93976502362793,null,null,null,0.21431841463371309,0.94872794065766253,4.4267215315077459,0.22791790210004134,4.9620308800187267,4.4662481027505914,112.00000000000045,null,null,null,null,null,null,null,null,197.93976502362793,null,null,null,null,null,null,null,null,{"$f":"L262*Input!$E$5/Input!$E$7","v":12.986055328581518},null,null,null,null,null,null,null,null,null,79521.105369470766,1.5583266394297822E-3]
[null,null,null,null,null,null,null,null,"18HD09(62)","18HD03(57)","MW125S",1.5137802619519041E-3,195.06816280589706,null,null,null,1.6383855150786579,1.2666709111301655,0.77312140486627368,2.1202362370621022,0.78986351457555204,1.2673006209630411,162.99999999999955,null,null,null,null,null,null,null,null,195.06816280589706,null,null,null,null,null,null,null,null,{"$f":"L263*Input!$E$5/Input!$E$7","v":12.614835516265869},null,null,null,null,null,null,null,null,null,280249.98971052066,1.5137802619519041E-3]
[null,null,null,null,null,null,null,null,"18HD09(62)","18HD03(57)","MW133S",1.6006370880873129E-3,224.95676202774672,null,null,null,0.94409728630878864,1.8292926706501633,1.9376103471309538,1.48128173902875,1.6618972544524204,5.5612261850490947,253.99999999999636,null,null,null,null,null,null,null,null,224.95676202774672,null,null,null,null,null,null,null,null,{"$f":"L264*Input!$E$5/Input!$E$7","v":13.338642400727608},null,null,null,null,null,null,null,null,null,401136.5076370489,1.6006370880873129E-3]
[null,null,null,null,null,null,null,null,"18HD09(62)","MW125S","MW132S",1.3799822550737524E-3,182.0930282830841,null,null,null,0.71079940691289512,1.4456114480641495,2.0337825749498721,0.77977292377188745,1.5433841556876882,3.2253525695476042,216.99999999999591,null,null,null,null,null,null,null,null,182.0930282830841,null,null,null,null,null,null,null,null,{"$f":"L265*Input!$E$5/Input!$E$7","v":11.499852125614604},null,null,null,null,null,null,null,null,null,455467.19456102385,1.3799822550737524E-3]
[null,null,null,null,null,null,null,null,"18HD09(62)","MW133S","MW132S",1.2681745115904479E-3,202.17605220282445,null,null,null,2.5604529540433445,2.0777944169728495,0.8114948621460496,3.3054927335418807,0.50419972657103829,2.1767460036308086,253.99999999999636,null,null,null,null,null,null,null,null,202.17605220282445,null,null,null,null,null,null,null,null,{"$f":"L266*Input!$E$5/Input!$E$7","v":10.568120929920399},null,null,null,null,null,null,null,null,null,674879.97399406123,1.2681745115904479E-3]
[null,null,null,null,null,null,null,null,"HAH","18HD03(57)","MW125S",1.4972465434805536E-3,195.44038348844506,null,null,null,1.5158724593406141,1.3351255474273303,0.8807637734958873,1.7501619828250525,0.7616455700649668,1.357679100567976,150.99999999999909,null,null,null,null,null,null,null,null,195.44038348844506,null,null,null,null,null,null,null,null,{"$f":"L267*Input!$E$5/Input!$E$7","v":12.477054529004613},null,null,null,null,null,null,null,null,null,290632.8750965264,1.4972465434805536E-3]
[null,null,null,null,null,null,null,null,"HAH","18HD03(57)","MW133S",1.8039942951403088E-3,228.54901287823822,null,null,null,0.87350081045180361,1.8091874133055896,2.0711914535829887,1.7374170082509004,2.2770755711805286,7.4532306191440725,241.99999999999591,null,null,null,null,null,null,null,null,228.54901287823822,null,null,null,null,null,null,null,null,{"$f":"L268*Input!$E$5/Input!$E$7","v":15.033285792835906},null,null,null,null,null,null,null,null,null,292764.83799658285,1.8039942951403088E-3]
[null,null,null,null,null,null,null,null,"HAH","MW125S","MW133S",1.1708306434729139E-3,170.15360565390424,null,null,null,0.66757942817652038,1.5698702056499647,2.3515856531679429,1.0329145140211693,2.3177067712932571,5.7119708683401544,241.99999999999591,null,null,null,null,null,null,null,null,170.15360565390424,null,null,null,null,null,null,null,null,{"$f":"L269*Input!$E$5/Input!$E$7","v":9.7569220289409504},null,null,null,null,null,null,null,null,null,382012.42706949706,1.1708306434729139E-3]
[null,null,null,null,null,null,null,null,"HAH","MW125S","MW132S",1.3078299693242985E-3,184.79197748828213,null,null,null,0.74921310572993738,1.368671896893618,1.8268125402853961,0.76599567645252975,1.3646321124512626,2.5563145191923886,204.99999999999545,null,null,null,null,null,null,null,null,184.79197748828213,null,null,null,null,null,null,null,null,{"$f":"L270*Input!$E$5/Input!$E$7","v":10.898583077702487},null,null,null,null,null,null,null,null,null,515128.46950251708,1.3078299693242985E-3]
[null,null,null,null,null,null,null,null,"HAH","MW133S","MW132S",1.2642291532213752E-3,202.10843002605509,null,null,null,2.532311713231715,1.9672082908871673,0.77684286677986913,3.5435060165282697,0.55258468836989005,2.1384521602427822,241.99999999999591,null,null,null,null,null,null,null,null,202.10843002605509,null,null,null,null,null,null,null,null,{"$f":"L271*Input!$E$5/Input!$E$7","v":10.535242943511461},null,null,null,null,null,null,null,null,null,615786.69390908233,1.2642291532213752E-3]
[null,null,null,null,null,null,null,null,"18HD03(57)","MW125S","MW133S",1.1012374586912613E-3,208.75674032719945,null,null,null,0.50001247407997496,0.86772116260837484,1.7353990302041673,0.5762396838596513,2.3048437307839356,1.7354090756225309,141.99999999999591,null,null,null,null,null,null,null,null,208.75674032719945,null,null,null,null,null,null,null,null,{"$f":"L272*Input!$E$5/Input!$E$7","v":9.1769788224271789},null,null,null,null,null,null,null,null,null,384144.38996955351,1.1012374586912613E-3]
[null,null,null,null,null,null,null,null,"18HD03(57)","MW125S","MW132S",8.9584882850136352E-4,223.47398649623852,null,null,null,0.56115554613841767,0.52708499874074344,0.93928502064689545,1.4679943153412891,4.6618452674368189,1.2951473064908403,104.99999999999545,null,null,null,null,null,null,null,null,223.47398649623852,null,null,null,null,null,null,null,null,{"$f":"L273*Input!$E$5/Input!$E$7","v":7.4654069041780291},null,null,null,null,null,null,null,null,null,150790.25819051013,8.9584882850136352E-4]
[null,null,null,null,null,null,null,null,"18HD03(57)","MW133S","MW132S",8.9584994442255003E-4,192.84453603005215,null,null,null,1.3996956283290163,0.75758549720966195,0.54125017030601308,2.6739008771371688,1.3648285270851404,0.78332393287789448,90.999999999996817,null,null,null,null,null,null,null,null,192.84453603005215,null,null,null,null,null,null,null,null,{"$f":"L274*Input!$E$5/Input!$E$7","v":7.4654162035212508},null,null,null,null,null,null,null,null,null,249316.51969701846,8.9584994442255003E-4]
[null,null,null,null,null,null,null,null,"MW125S","MW133S","MW132S",1.0692501879292834E-3,198.08711425370663,null,null,null,1.6130707520391954,1.437311816916828,0.89104077741154353,1.8343621809809911,0.70498236699388583,1.4563985802146271,141.99999999999591,null,null,null,null,null,null,null,null,198.08711425370663,null,null,null,null,null,null,null,null,{"$f":"L275*Input!$E$5/Input!$E$7","v":8.9104182327440284},null,null,null,null,null,null,null,null,null,482670.65147606196,1.0692501879292834E-3]

{"sheet":"MatrixCalculator","index":3,"n_rows":53,"n_cols":41,"rows_kept":53,"cut":false,"hidden":false,"merged":[[0,9,0,11],[4,0,4,4],[3,1,3,4],[0,6,0,7],[0,1,0,4]]}
[null,null,null,null,null," "," ",null," "," ",null,null," "]
[null,null,null,null,null,null,"gradient","angle on x",null,"A","B","C",null,null,null,null,null,null,null,null,null,null,null,null,null,null,null,null,null,null,null,null,null,null,null,null,null,null,null,null,{"$f":"-L2*Input!$E$5/Input!$E$7","v":{"$error":"#VALUE!"}}]
[null,null,null,null,null,null,{"$f":"((F51^2+F52^2)/F53^2)^0.5","v":1.4696267471909523E-3},{"$f":"ATAN(F52/F51)*180/PI()","v":-5.1900777616126454},null,{"$f":"F51","v":-1.8905898129682112E-6},{"$f":"F52","v":1.7172704076635838E-7},{"$f":"-F53","v":-1.2917381884932416E-3}]
[null,null,null,null,null,null,null,{"$f":"IF(M9>N9,H3,H3+180)","v":174.80992223838734},null,null,null,null,"x","y","H"]
["Data Points Input",null,null,null,null,null,null,null,null,null,null,null,0,0,{"$f":"(J3*M5+K3*N5-1)/L3","v":774.15068231934686}]
["#","x","y","z","D","calc z",null,null,null,null,null,null,"Determine if plane dips to the east or west"]
["18HD07",601.29399999999441,0,774.75,1,{"$f":"(B7*$J$3+C7*$K$3-E7)/$L$3","v":775.03073705576742},null,null,null,null,null,null,"west x","east x","north y","south y"]
["18HD05(65)",235.60499999998137,213.95299999997951,774.42,1,{"$f":"(B8*$J$3+C8*$K$3-E8)/$L$3","v":774.46707065637361},null,null,null,null,null,null,-1000000,1000000,1000000,-1000000]
["MW108S",0,876.46400000003632,774.18,1,774.03416291131271,null,1,null,null,null,null,{"$f":"(-1)*(1-$J$3*M8)/$L$3","v":-689.45071137600019},{"$f":"(-1)*(1-$J$3*N8)/$L$3","v":2237.752076014694},{"$f":"(-1)*(1-$K$3*O8)/$L$3","v":641.20807653738825},{"$f":"(-1)*(1-$K$3*P8)/$L$3","v":907.09328810130546}]
["HR6",964.22900000005029,243.02399999997579,775.51,1,775.52962098376076,null,null,null,null,null,null,"flow direction E-W",{"$f":"IF(N9=M9,\"ND\",IF(N9>M9,\"west\",\"east\"))","v":"west"},"flow direction N-S",{"$f":"IF(P9=O9,\"ND\",IF(P9>O9,\"north\",\"south\"))","v":"north"}]
["HR13",801.62000000011176,551.55300000007264,775.41,1,775.2506095755142]
["HAS",296.06099999998696,1618.6759999999776,773.74,1,774.36880660620898]
["18HD06",782.77399999997579,131.10900000005495,775.19,1,775.27892146459385]
["18HD08(47)",556.50800000014715,489.57900000002701,774.91,1,774.90010229575341]
["18HD09(62)",451.2160000000149,695.53300000005402,774.89,1,774.71861671637714]
["HAH",470.84499999997206,884.9089999999851,775.01,1,774.7221696092214]
["18HD03(57)",1446.7360000000335,1139.7540000000736,776.52,1,776.11660527854565]
["MW125S",1270.5770000000484,498.1260000000475,776.01,1,775.94407841889642]
["MW133S",2559.1700000001583,830.26100000005681,777.43,1,777.78591003723125]
["MW132S",1997.7360000000335,1434.6950000000652,777.06,1,776.88383942137989]
[null,0,0,0,1,774.15068231934686]
[null,0,0,0,1,774.15068231934686]
[null,0,0,0,1,774.15068231934686]
[null,0,0,0,1,774.15068231934686]
[null,0,0,0,1,774.15068231934686]
[null,0,0,0,1,774.15068231934686]
[]
[]
[]
[null,null,null,null,null,"Pt"]
[null,null,null,null,null,{"$f":"TRANSPOSE(B7:D26)","v":601.29399999999441},235.60499999998137,0,964.22900000005029,801.62000000011176,296.06099999998696,782.77399999997579,556.50800000014715,451.2160000000149,470.84499999997206,1446.7360000000335,1270.5770000000484,2559.1700000001583,1997.7360000000335,0,0,0,0,0,0]
[null,null,null,null,null,0,213.95299999997951,876.46400000003632,243.02399999997579,551.55300000007264,1618.6759999999776,131.10900000005495,489.57900000002701,695.53300000005402,884.9089999999851,1139.7540000000736,498.1260000000475,830.26100000005681,1434.6950000000652,0,0,0,0,0,0]
[null,null,null,null,null,774.75,774.42,774.18,775.51,775.41,773.74,775.19,774.91,774.89,775.01,776.52,776.01,777.43,777.06,0,0,0,0,0,0]
[]
[null,null,null,null,null,"{[P]t[P]}"]
[null,null,null,null,null,{"$f":"MMULT(F31:Y33,B7:D26)","v":17672486.858066529},9584427.3544248864,9650668.0915103965]
[null,null,null,null,null,9584427.3544248864,9615907.4218966365,7450507.3823203146]
[null,null,null,null,null,9650668.0915103965,7450507.3823203146,8416563.1225000005]
[]
[null,null,null,null,null,"{[P]t[P]}'"]
[null,null,null,null,null,{"$f":"MINVERSE(F36:H38)","v":1.6005964005854094E-7},-5.5187126195136503E-8,-1.3467615622052179E-7]
[null,null,null,null,null,-5.5187126195136469E-8,3.5009119232573098E-7,-2.4662850439812873E-7]
[null,null,null,null,null,-1.3467615622052187E-7,-2.4662850439812857E-7,4.9155722068708752E-7]
[]
[null,null,null,null,null,"{[P]t[P]}'[P]t"]
[null,null,null,null,null,{"$f":"MMULT(F41:H43,F31:Y33)","v":-8.0974508224898405E-6},-7.8392508615133833E-5,-1.526331159962997E-4,3.6479644606992554E-5,-6.560854645519453E-6,-1.4614698869973446E-4,1.3655386218272997E-5,-4.2305888102612714E-5,-7.0522203588948E-5,-7.7847671263318587E-5,6.4085566761963432E-5,7.1367910874900215E-5,2.5909882633621802E-4,1.3592875712274108E-4,0,0,0,0,0,0]
[null,null,null,null,null,-2.2425912164082831E-4,-1.29093348371543E-4,1.159074712556489E-4,-1.5939533702604585E-4,-4.2383465295045119E-5,3.5951911606757145E-4,-1.8848289171000235E-4,-5.0429675720116554E-5,2.748870116558007E-5,9.2674707282823808E-5,1.2766466837976323E-4,-8.7116153669168764E-5,-4.2302572487479706E-5,2.0037962880960854E-4,0,0,0,0,0,0]
[null,null,null,null,null,2.9985399204885934E-4,2.9617445865667304E-4,1.6439276363271909E-4,1.9141223912583403E-4,1.3717059265714579E-4,-5.8746514537514737E-5,2.4329403181191605E-4,1.8522011098190291E-4,1.4859647468345934E-4,9.9306383630611938E-5,-9.4232654939723035E-5,8.7484821901344378E-5,-1.6727387732624042E-4,-2.4091463383374586E-4,0,0,0,0,0,0]
[]
[null,null,null,null,null,"{[P]t[P]}'[P]t [D]"]
[null,null,null,null,null,{"$f":"MMULT(F46:Y48,E7:E26)","v":-1.8905898129682112E-6},"A"]
[null,null,null,null,null,1.7172704076635838E-7,"B"]
[null,null,null,null,null,1.2917381884932416E-3,"C"]

{"sheet":"Reject","index":4,"n_rows":91,"n_cols":13,"rows_kept":91,"cut":false,"hidden":false,"merged":[]}
["Well A","Well B","Well C",null,"AB/BC","AC/BC","AC/AB","AB/H1","BC/H2","AC/H3","Max DWL (cm)","DWL Min."]
["18HD07","HR6","18HD06",null,2.0487929694810134,1.0501567288793097,0.51257337589621288,54.821773240671547,13.060413543219907,14.403404834568882,75.999999999999091,1.4142135623730951E-2,"Reject on ratio >  8"]
["18HD07","HR6","18HD03(57)",null,0.42893640920032589,1.3935837095820873,3.2489284651311632,0.91636911171331903,4.9806338776147658,9.672767305171492,176.99999999999818,1.4142135623730951E-2,"Reject on ratio >  8"]
["18HD07","HR6","MW125S",null,1.0956493690736246,2.09280407548489,1.9101038475971224,10.519819362919334,8.7632478828228919,38.381526320733819,125.99999999999909,1.4142135623730951E-2,"Reject on ratio >  8"]
["18HD07","HR6","MW133S",null,0.25699177206726787,1.2512515522617003,4.8688389600822859,1.0934341485842158,16.555953386070584,25.920504700962624,267.999999999995,1.4142135623730951E-2,"Reject on ratio >  8"]
["18HD07","HR6","MW132S",null,0.27690140637409988,1.269233261769251,4.5837010305916932,1.0521163605535806,13.721874752533648,22.105296296915757,230.99999999999454,1.4142135623730951E-2,"Reject on ratio >  8"]
["18HD07","HR13","18HD03(57)",null,0.67216026321160316,1.6255027976837753,2.41832623356381,1.4469108651946498,3.202551404306504,8.4619713767613387,176.99999999999818,1.4142135623730951E-2,"Reject on ratio >  8"]
["18HD07","HR13","MW132S",null,0.39467185238006419,1.3465645445554695,3.4118585767772061,0.7132096240562027,4.578728441587768,8.3023155771732196,230.99999999999454,1.4142135623730951E-2,"Reject on ratio >  8"]
["18HD07","HAS","18HD06",null,1.0524144198066063,0.14304241605216414,0.13591833536303111,8.1290393903529452,7.3394860267341793,0.15017419820365424,145.00000000000455,1.4142135623730951E-2,"Reject on ratio >  8"]
["18HD07","HAS","18HD08(47)",null,1.4215394975459987,0.42427170614182136,0.29845931602621023,35.264117730367367,17.450792742351556,3.1412557857977377,116.99999999999591,1.4142135623730951E-2,"Reject on ratio >  8"]
["18HD07","HAS","18HD09(62)",null,1.7596619472687947,0.76011882381349283,0.43196866590954469,88.588098951985117,28.609936709436759,16.530267150828269,114.99999999999773,1.4142135623730951E-2,"Reject on ratio >  8"]
["18HD07","HAS","HAH",null,2.1837607410076108,1.1858363506983844,0.54302485085945218,46.027754046357948,9.6518302565634606,13.572479479801656,126.99999999999818,1.4142135623730951E-2,"Reject on ratio >  8"]
["18HD07","18HD06","18HD03(57)",null,0.18540233996523292,1.1751662652430419,6.3384651211166574,0.52214442973627473,15.190085806390671,20.977747757139646,176.99999999999818,1.4142135623730951E-2,"Reject on ratio >  8"]
["18HD07","18HD06","MW125S",null,0.36675228992113268,1.3667018090211085,3.7264983657361959,18.908637661507985,140.57709724416941,262.58028171192848,125.99999999999909,1.4142135623730951E-2,"Reject on ratio >  8"]
["18HD07","18HD06","MW133S",null,0.11727690367568619,1.1139914490010818,9.4988136119425377,0.4727866893235424,34.374806211439953,42.658342115747949,267.999999999995,1.4142135623730951E-2,"Reject on ratio >  8"]
["18HD07","18HD06","MW132S",null,0.12563809448002611,1.123521997495007,8.9425265652498744,0.64859014231329737,41.089197739607627,51.866963289518793,230.99999999999454,1.4142135623730951E-2,"Reject on ratio >  8"]
["18HD07","18HD08(47)","18HD09(62)",null,2.1254038600511098,3.0761575217998818,1.4473284723054511,5.7104306117448465,1.2641130907150679,11.961979953652193,15.999999999996817,1.4142135623730951E-2,"Reject on ratio >  8"]
["18HD07","18HD08(47)","HAH",null,1.2153711773009062,2.2112787802366447,1.8194267081003581,9.9735003017584312,6.7519581159387405,33.015413151431126,25.999999999999091,1.4142135623730951E-2,"Reject on ratio >  8"]
["18HD07","18HD09(62)","HAH",null,3.7372664724728635,4.698092081664031,1.2570931498377775,12.033372253861792,0.86154749158796795,19.016135860131183,25.999999999999091,1.4142135623730951E-2,"Reject on ratio >  8"]
["18HD07","18HD03(57)","MW132S",null,2.2706393985930231,3.20349686462326,1.4108347043604863,5.3184126934916085,1.0315391038538291,10.586058813826094,230.99999999999454,1.4142135623730951E-2,"Reject on ratio >  8"]
["18HD07","MW125S","MW133S",null,0.62696490998670029,1.5981283866779479,2.5489917557138067,1.6589296580385822,4.2202822925893972,10.778661495412212,267.999999999995,1.4142135623730951E-2,"Reject on ratio >  8"]
["18HD07","MW125S","MW132S",null,0.70363211861978003,1.6885151408559267,2.3997129979911356,2.6305188832453914,5.3131259708058618,15.148165155991231,230.99999999999454,1.4142135623730951E-2,"Reject on ratio >  8"]
["18HD05(65)","HR6","MW133S",null,0.42904105053281921,1.4143875552860565,3.2966252379103382,1.3937779555337795,7.5717435554588466,15.147213594088804,300.99999999999909,1.4142135623730951E-2,"Reject on ratio >  8"]
["18HD05(65)","HR13","18HD08(47)",null,2.6067394626262228,1.6731823949980558,0.64186790394171866,9.1112268558948841,1.3408543546152927,3.7537744974327731,99.000000000000909,1.4142135623730951E-2,"Reject on ratio >  8"]
["18HD05(65)","HR13","18HD03(57)",null,0.75491249168641594,1.7461893100975863,2.3131016234699397,3.7723545268253109,6.6194099360036116,20.183753236718658,210.00000000000227,1.4142135623730951E-2,"Reject on ratio >  8"]
["18HD05(65)","HR13","MW133S",null,0.37035443926266282,1.3508829567558953,3.647540878530747,0.99713213335975825,7.269718637963555,13.266398772652156,300.99999999999909,1.4142135623730951E-2,"Reject on ratio >  8"]
["18HD05(65)","HR13","MW132S",null,0.44326141812541525,1.4417812444352551,3.252665775723619,4.5214846965120881,23.012362264249187,47.836560455109257,263.99999999999864,1.4142135623730951E-2,"Reject on ratio >  8"]
["18HD05(65)","18HD06","MW133S",null,0.28988800522075686,1.2592317182857493,4.3438558878171358,0.57815104161502051,6.8798793275914072,10.90918055396085,300.99999999999909,1.4142135623730951E-2,"Reject on ratio >  8"]
["18HD05(65)","18HD08(47)","18HD03(57)",null,0.38373736601965258,1.3828756958795259,3.6037035179125714,4.8724109724229265,33.088397323212504,63.276437474268128,210.00000000000227,1.4142135623730951E-2,"Reject on ratio >  8"]
["18HD05(65)","18HD08(47)","MW133S",null,0.20823871625715076,1.1833575497018314,5.6826971034556397,0.40425719906352975,9.3225518404633352,13.054696474612527,300.99999999999909,1.4142135623730951E-2,"Reject on ratio >  8"]
["18HD05(65)","18HD08(47)","MW132S",null,0.24544701870337007,1.2438028332420519,5.067500268745265,1.9047330208054927,31.616849224535542,48.912703936991889,263.99999999999864,1.4142135623730951E-2,"Reject on ratio >  8"]
["18HD05(65)","18HD09(62)","HAH",null,2.7713728989541213,3.7344243735369038,1.347499780684954,8.8725203603244935,1.1551997152836959,16.110329053372798,59.000000000003183,1.4142135623730951E-2,"Reject on ratio >  8"]
["18HD05(65)","18HD03(57)","MW132S",null,2.4392244975273747,3.430018794639889,1.4061923361776973,15.198708454264807,2.554483713913867,30.053574799453926,263.99999999999864,1.4142135623730951E-2,"Reject on ratio >  8"]
["18HD05(65)","MW125S","MW133S",null,0.80654466500773503,1.8064895885890686,2.2397886527111845,51.34960919965976,78.936941838028702,257.60318176280697,300.99999999999909,1.4142135623730951E-2,"Reject on ratio >  8"]
["MW108S","HR6","18HD08(47)",null,2.4213010726154458,1.4224892686501329,0.58748962891821854,64.827030202887826,11.057540474585581,22.374664666880793,133.00000000000409,1.4142135623730951E-2,"Reject on ratio >  8"]
["MW108S","HR6","18HD09(62)",null,1.6865071026356384,0.71066179471423985,0.42138084897693717,11.952151729959281,4.2021325620757448,2.1222458127075359,133.00000000000409,1.4142135623730951E-2,"Reject on ratio >  8"]
["MW108S","HR13","18HD09(62)",null,2.2832413986773186,1.283261747400027,0.56203507353336368,477.4077993937982,91.576881285935642,150.8052102603186,123.00000000000182,1.4142135623730951E-2,"Reject on ratio >  8"]
["MW108S","HR13","MW125S",null,1.8325862527740289,2.8087624967693956,1.5326768344560624,6.8299618668131261,2.0337119016288261,16.044251666134834,183.00000000000409,1.4142135623730951E-2,"Reject on ratio >  8"]
["MW108S","HR13","MW133S",null,0.48606800094302843,1.438365221692854,2.9591851734783159,0.94171745892916792,3.9859014746245065,8.2464096821399231,325,1.4142135623730951E-2,"Reject on ratio >  8"]
["MW108S","18HD06","18HD08(47)",null,2.5497917812893718,1.5988809298578899,0.62706333183385365,10.43557934849013,1.6051186127047552,4.1033576896382034,101.00000000001046,1.4142135623730951E-2,"Reject on ratio >  8"]
["MW108S","18HD09(62)","MW125S",null,0.57681102650775373,1.5729710472148595,2.7270127908931627,3.9938060037877339,12.003830592702563,29.700332782217586,183.00000000000409,1.4142135623730951E-2,"Reject on ratio >  8"]
["MW108S","18HD09(62)","MW133S",null,0.23015202814969932,1.2117793024284005,5.2651254571617976,0.53446307688550043,10.089928643055266,14.816142813754645,325,1.4142135623730951E-2,"Reject on ratio >  8"]
["MW108S","HAH","18HD03(57)",null,0.46689725097415719,1.4579350613530393,3.1226036527547172,1.9844667560752431,9.1033490292330299,19.349847864031471,234.00000000000318,1.4142135623730951E-2,"Reject on ratio >  8"]
["MW108S","HAH","MW125S",null,0.5301049668754767,1.4923215823382805,2.8151435575755159,1.1741833075576407,4.1784206123821255,9.3054417537062228,183.00000000000409,1.4142135623730951E-2,"Reject on ratio >  8"]
["MW108S","HAH","MW133S",null,0.2254244773782085,1.2252456434724368,5.4352821739795667,5.1137538180734525,100.63236371689823,151.07201009889349,325,1.4142135623730951E-2,"Reject on ratio >  8"]
["MW108S","HAH","MW132S",null,0.29018027585504769,1.2781567093684087,4.4046987880281705,0.90160132459935238,10.707270207970573,17.492302165236367,287.99999999999955,1.4142135623730951E-2,"Reject on ratio >  8"]
["MW108S","18HD03(57)","MW133S",null,1.2735074576779797,2.2166989963778407,1.7406250611359648,2.9195628590527605,1.800175493127312,8.8456203231101611,325,1.4142135623730951E-2,"Reject on ratio >  8"]
["MW108S","18HD03(57)","MW132S",null,2.3528998743001996,3.3189659582761686,1.4105852928668698,7.6780689785485947,1.3868998985025365,15.277444418103832,287.99999999999955,1.4142135623730951E-2,"Reject on ratio >  8"]
["HR6","HR13","HAS",null,0.29535141823604522,1.2951444023443655,4.3850962696555751,6.9328833324006149,79.475957828201572,133.31289400696986,176.99999999999818,1.4142135623730951E-2,"Reject on ratio >  8"]
["HR6","HR13","HAH",null,0.74264555756300898,1.7239545149723776,2.3213691880545726,2.5420997249495261,4.6092409185067691,13.698752367538464,50,1.4142135623730951E-2,"Reject on ratio >  8"]
["HR6","HAS","18HD06",null,0.97710740150569364,0.13621054088261089,0.13940181056116704,7.209891654463644,7.5516896297244376,0.14010884965538578,176.99999999999818,1.4142135623730951E-2,"Reject on ratio <  .2"]
["HR6","HAS","HAH",null,2.0274986193634632,1.0733111736639718,0.52937701826940808,9.3615462562083156,2.2773325481916702,2.6234799800184314,176.99999999999818,1.4142135623730951E-2,"Reject on ratio >  8"]
["HR6","18HD06","18HD03(57)",null,0.17654730467050167,0.84326923252816643,4.776449202110439,0.4180684447931986,13.41297779504856,9.5380087292571343,132.99999999999272,1.4142135623730951E-2,"Reject on ratio >  8"]
["HR6","18HD06","MW125S",null,0.3492357662770183,0.65304814006750822,1.869934878174826,3.7861232899075228,31.042545235522272,13.238772416905446,81.999999999993634,1.4142135623730951E-2,"Reject on ratio >  8"]
["HR6","18HD06","MW133S",null,0.1116756198866049,0.89030175186395266,7.9722123124811164,0.63178234183654514,50.658314941954103,40.153665387079556,223.99999999998954,1.4142135623730951E-2,"Reject on ratio >  8"]
["HR6","18HD06","MW132S",null,0.11963747031750457,0.88519741117473605,7.3989980632783388,0.45193405937174858,31.574801543946641,24.741207966801408,186.99999999998909,1.4142135623730951E-2,"Reject on ratio >  8"]
["HR6","18HD08(47)","18HD09(62)",null,2.0599025473842731,2.9573811101478569,1.4356898164445833,3.9134615537203792,0.92229047247423523,8.0664474964551722,62.000000000000455,1.4142135623730951E-2,"Reject on ratio >  8"]
["HR6","MW125S","MW133S",null,0.29958127343642343,1.2772238993743905,4.263363609893462,0.70019604272337832,7.8017194125397529,12.726951814443245,191.99999999999591,1.4142135623730951E-2,"Reject on ratio >  8"]
["HR6","MW125S","MW132S",null,0.33621499827056328,1.3303426499414432,3.9568212506417475,1.5670665233720404,13.862873712869828,24.534674238544756,154.99999999999545,1.4142135623730951E-2,"Reject on ratio >  8"]
["HR13","HAS","18HD06",null,0.75443896428615453,0.26889551693674313,0.35641785441340562,5.9927790943280907,10.528828426663662,0.76128482339735148,166.99999999999591,1.4142135623730951E-2,"Reject on ratio >  8"]
["HR13","18HD08(47)","18HD03(57)",null,0.22934580662982559,0.79193916025189937,3.4530352740659636,0.61347329991073662,11.663101576172949,7.3147198152706707,161.00000000000136,1.4142135623730951E-2,"Reject on ratio >  8"]
["HR13","18HD08(47)","MW125S",null,0.35403758476806879,0.66094001849497641,1.8668639910871621,1.5161902207678402,12.096366937702181,5.2841975942428654,110.00000000000227,1.4142135623730951E-2,"Reject on ratio >  8"]
["HR13","18HD08(47)","MW133S",null,0.12445667422731443,0.87598821480702438,7.0384993030351417,1.5741010820376178,101.62398818031636,77.981711270611058,251.99999999999818,1.4142135623730951E-2,"Reject on ratio >  8"]
["HR13","18HD08(47)","MW132S",null,0.14669471746602694,0.86268484767898934,5.880817404885617,0.44906839801389364,20.86813049332234,15.5305874717985,214.99999999999773,1.4142135623730951E-2,"Reject on ratio >  8"]
["HR13","18HD09(62)","MW125S",null,0.44948821055128535,0.56002280328937448,1.2459121065767695,2.9408808351383651,14.555958765529414,4.565120431027613,112.00000000000045,1.4142135623730951E-2,"Reject on ratio >  8"]
["HR13","18HD09(62)","MW133S",null,0.17934924703865174,0.84246982904816214,4.6973703149509216,0.40920476256427418,12.721594964360067,9.0292208861217809,253.99999999999636,1.4142135623730951E-2,"Reject on ratio >  8"]
["HR13","18HD03(57)","MW132S",null,1.3968843374668569,2.3790147138329747,1.7030863973656805,5.6950517726577123,2.9186148026753749,16.51851632866336,164.99999999999773,1.4142135623730951E-2,"Reject on ratio >  8"]
["HR13","MW125S","MW133S",null,0.3546911459187938,1.3372658079329824,3.7702260778709942,0.99186305730960422,7.8840799582101795,14.098941254624878,201.99999999999818,1.4142135623730951E-2,"Reject on ratio >  8"]
["HAS","18HD06","18HD08(47)",null,3.6922405262507922,2.7334922300285429,0.74033427957744935,15.111265884340146,1.1084621738273082,8.2824069404506915,145.00000000000455,1.4142135623730951E-2,"Reject on ratio >  8"]
["HAS","18HD06","18HD09(62)",null,2.3910156756040344,1.4300129515757161,0.5980776145327682,11.211533171547494,1.9611018954949835,4.0103299085953559,145.00000000000455,1.4142135623730951E-2,"Reject on ratio >  8"]
["HAS","18HD06","HAH",null,1.9185883674571851,0.92462055282370359,0.48192752990009841,25.221035861243411,6.8517152473906346,5.8576900966533598,145.00000000000455,1.4142135623730951E-2,"Reject on ratio >  8"]
["HAS","18HD08(47)","18HD09(62)",null,5.0095347610586378,4.0469429586901873,0.8078480640854897,20.579311901456045,0.82004193244944312,13.430439553992617,116.99999999999591,1.4142135623730951E-2,"Reject on ratio >  8"]
["HAS","18HD08(47)","HAH",null,2.8646057696212339,1.8647419426249985,0.65095936145920685,215.15179324032673,26.218946994680245,91.170161504050895,126.99999999999818,1.4142135623730951E-2,"Reject on ratio >  8"]
["HAS","18HD09(62)","HAH",null,4.9166871749381391,3.9618384770353385,0.80579429523807067,18.446538937784975,0.76307941608389407,11.977419750010219,126.99999999999818,1.4142135623730951E-2,"Reject on ratio >  8"]
["HAS","18HD03(57)","MW133S",null,1.0793968890021959,2.0754681936396886,1.9228035718708341,8.7941042982209581,7.5479547517773646,32.513330035963854,368.99999999999409,1.4142135623730951E-2,"Reject on ratio >  8"]
["18HD06","18HD08(47)","18HD09(62)",null,1.8326500825672107,2.8300044095620978,1.544214270079193,20.290158921353605,6.0412435865184255,48.383866538276173,30.000000000006821,1.4142135623730951E-2,"Reject on ratio >  8"]
["18HD06","18HD08(47)","HAH",null,1.0479655797636278,2.0167645386318238,1.9244568500873012,3.0590832782016015,2.7854621594339215,11.32941944311191,28.00000000000864,1.4142135623730951E-2,"Reject on ratio >  8"]
["18HD06","18HD09(62)","HAH",null,3.4382116396361964,4.2848263159803865,1.2462369292757591,5.8009416963045437,0.4907194682604889,9.0094801612023492,30.000000000006821,1.4142135623730951E-2,"Reject on ratio >  8"]
["18HD06","18HD03(57)","MW132S",null,1.9321856538516453,2.8512987478355947,1.4756857045034864,4.0513293264690793,1.0851751531317344,8.8223704143511128,186.99999999998909,1.4142135623730951E-2,"Reject on ratio >  8"]
["18HD06","MW125S","MW133S",null,0.45874301610514434,1.4345966372641303,3.1272337384975457,1.1985537712833945,5.6953260448247569,11.721365501105364,223.99999999998954,1.4142135623730951E-2,"Reject on ratio >  8"]
["18HD06","MW125S","MW132S",null,0.51483953118036196,1.5028767969124079,2.9191169401207273,1.9615243425775275,7.4003102899298394,16.714626966396398,186.99999999998909,1.4142135623730951E-2,"Reject on ratio >  8"]
["18HD08(47)","18HD09(62)","MW133S",null,0.10950767123635087,0.96173648778340459,8.7823663577657918,0.1193401578768841,9.9517056290084902,9.2047014652438062,253.99999999999636,1.4142135623730951E-2,"Reject on ratio >  8"]
["18HD08(47)","18HD09(62)","MW132S",null,0.13494561252889625,1.0054813861721814,7.4510120583347987,0.13499389148739152,7.4130440204851746,7.4945342637741694,216.99999999999591,1.4142135623730951E-2,"Reject on ratio <  .2"]
["18HD08(47)","HAH","MW133S",null,0.1936318132191619,0.97242413652689375,5.0220267029481196,0.19932356411320695,5.3162478435634215,5.0270902191413311,251.99999999999818,1.4142135623730951E-2,"Reject on ratio <  .2"]
["18HD08(47)","18HD03(57)","MW132S",null,1.7638783477035498,2.7576869122410059,1.5634223957855868,12.700794083683371,4.0821937802306199,31.04441873355707,214.99999999999773,1.4142135623730951E-2,"Reject on ratio >  8"]
["18HD08(47)","MW125S","MW133S",null,0.53664649740298587,1.526579679188464,2.8446653180000241,2.2549601502490115,7.8300092141898885,18.247409870581851,251.99999999999818,1.4142135623730951E-2,"Reject on ratio >  8"]
["18HD09(62)","HAH","MW133S",null,9.1137830486843471E-2,1.0111128660285333,11.09432669866435,9.1409522844574667E-2,11.005101939428616,11.251057470168158,253.99999999999636,1.4142135623730951E-2,"Reject on ratio >  8"]
["18HD09(62)","HAH","MW132S",null,0.1173182304738454,1.0562147519395673,9.0029891149358647,0.13021966909886473,9.4611859841493384,10.554800708537037,216.99999999999591,1.4142135623730951E-2,"Reject on ratio >  8"]
["18HD09(62)","18HD03(57)","MW132S",null,1.7442900494146969,2.742653369983691,1.5723608415377928,24.325438291213501,7.9950883529918597,60.140233929761301,216.99999999999591,1.4142135623730951E-2,"Reject on ratio >  8"]
["18HD09(62)","MW125S","MW133S",null,0.63335125611933007,1.5873159629275388,2.5062174387295628,1.3490992053866653,3.3632148663438426,8.4738618934278982,253.99999999999636,1.4142135623730951E-2,"Reject on ratio >  8"]
["HAH","18HD03(57)","MW132S",null,1.6138578024981352,2.5966815602104143,1.6089903064513731,6.9011910815522359,2.6496805627416622,17.86614719440168,204.99999999999545,1.4142135623730951E-2,"Reject on ratio >  8"]

{"sheet":"EstimatorGraphs","index":5,"n_rows":824,"n_cols":37,"rows_kept":824,"cut":false,"hidden":false,"merged":[]}
[null,"well","well","well","well",null,null,null,null,null,null,"max grad",4.4840142617822163E-3,"Vector \nMag. factor",{"$f":"Input!E5/Input!E7","v":8333.3333333333339},"K (L/T)",{"$f":"Input!E5","v":2500},"n",{"$f":"Input!E7","v":0.3},null,null,null,null,null,null,null,null,null,null,null,null,"Replotting Estimators","Well 1","Well 2","Well 3",null,"Row Source"]
[null,"A","B","C","A","gradient","angle"," centroid","x'_ y'","Vel (L/T)",null,null,null,"days",{"$f":"Input!N25","v":5}]
[null,"18HD07","18HD05(65)","MW108S","18HD07",8.7342580070510578E-4,176.57356556612888,null,null,null,null,null,null,null,null,null,null,null,null,null,null,null,null,null,null,null,null,null,null,null,null,null,"18HD07","18HD05(65)","MW133S",null,{"$f":"IF(ISBLANK(Input!A5), \"\",Input!A5)","v":"18HD07"}]
[null,601.29399999999441,235.60499999998137,0,601.29399999999441,null,null,278.96633333332528,{"$f":"H4+(COS(G3*PI()/180)*$O$1)*ABS(F3)*$O$2","v":242.63864877171184},{"$f":"(-1)*$Q$1*F3/$S$1","v":-7.2785483392092143},null,null,null,null,null,null,null,null,null,null,null,null,null,null,null,null,null,null,null,null,null,null,"18HD07","MW108S","MW133S",null,{"$f":"IF(ISBLANK(Input!A6), \"\",Input!A6)","v":"18HD05(65)"}]
[null,0,213.95299999997951,876.46400000003632,0,null,null,363.47233333333861,{"$f":"H5+(SIN((G3)*PI()/180)*$O$1)*ABS(F3)*$O$2","v":365.64741552650815},null,null,null,null,null,null,null,null,null,null,null,null,null,null,null,null,null,null,null,null,null,null,null,"18HD07","HR13","HAH",null,{"$f":"IF(ISBLANK(Input!A7), \"\",Input!A7)","v":"MW108S"}]
[null,"18HD07","18HD05(65)","HR6","18HD07",1.7401205926997072E-3,213.07918334678567,null,null,null,null,null,null,null,null,null,null,null,null,null,null,null,null,null,null,null,null,null,null,null,null,null,"18HD07","18HD08(47)","MW125S",null,{"$f":"IF(ISBLANK(Input!A8), \"\",Input!A8)","v":"HR6"}]
[null,601.29399999999441,235.60499999998137,964.22900000005029,601.29399999999441,null,null,600.37600000000873,{"$f":"H7+(COS(G6*PI()/180)*$O$1)*ABS(F6)*$O$2","v":539.62280210165898},{"$f":"(-1)*$Q$1*F6/$S$1","v":-14.501004939164227},null,null,null,null,null,null,null,null,null,null,null,null,null,null,null,null,null,null,null,null,null,null,"18HD07","18HD03(57)","MW125S",null,{"$f":"IF(ISBLANK(Input!A9), \"\",Input!A9)","v":"HR13"}]
[null,0,213.95299999997951,243.02399999997579,0,null,null,152.32566666665176,{"$f":"H8+(SIN((G6)*PI()/180)*$O$1)*ABS(F6)*$O$2","v":112.75260068402179},null,null,null,null,null,null,null,null,null,null,null,null,null,null,null,null,null,null,null,null,null,null,null,"18HD05(65)","MW108S","MW125S",null,{"$f":"IF(ISBLANK(Input!A10), \"\",Input!A10)","v":"HAS"}]
[null,"18HD07","18HD05(65)","HR13","18HD07",1.5034246405873108E-3,208.46606684913041,null,null,null,null,null,null,null,null,null,null,null,null,null,null,null,null,null,null,null,null,null,null,null,null,null,"18HD05(65)","HR6","MW132S",null,{"$f":"IF(ISBLANK(Input!A11), \"\",Input!A11)","v":"18HD06"}]
[null,601.29399999999441,235.60499999998137,801.62000000011176,601.29399999999441,null,null,546.17300000002922,{"$f":"H10+(COS(G9*PI()/180)*$O$1)*ABS(F9)*$O$2","v":491.10383623849992},{"$f":"(-1)*$Q$1*F9/$S$1","v":-12.528538671560923},null,null,null,null,null,null,null,null,null,null,null,null,null,null,null,null,null,null,null,null,null,null,"18HD05(65)","HAS","MW125S",null,{"$f":"IF(ISBLANK(Input!A12), \"\",Input!A12)","v":"18HD08(47)"}]
[null,0,213.95299999997951,551.55300000007264,0,null,null,255.16866666668406,{"$f":"H11+(SIN((G9)*PI()/180)*$O$1)*ABS(F9)*$O$2","v":225.31076597481007},null,null,null,null,null,null,null,null,null,null,null,null,null,null,null,null,{"$f":"360-17","v":343},null,null,null,null,null,null,"18HD05(65)","18HD08(47)","MW125S",null,{"$f":"IF(ISBLANK(Input!A13), \"\",Input!A13)","v":"18HD09(62)"}]
[null,"18HD07","18HD05(65)","HAS","18HD07",7.9054747278982287E-4,139.818022641433,null,null,null,null,null,null,null,null,null,null,null,null,null,null,null,null,null,null,null,null,null,null,null,null,null,"18HD05(65)","MW125S","MW132S",null,{"$f":"IF(ISBLANK(Input!A14), \"\",Input!A14)","v":"HAH"}]
[null,601.29399999999441,235.60499999998137,296.06099999998696,601.29399999999441,null,null,377.65333333332092,{"$f":"H13+(COS(G12*PI()/180)*$O$1)*ABS(F12)*$O$2","v":352.48760431710309},{"$f":"(-1)*$Q$1*F12/$S$1","v":-6.5878956065818572},null,null,null,null,null,null,null,null,null,null,null,null,null,null,null,null,null,null,null,null,null,null,"MW108S","HR13","18HD06",null,{"$f":"IF(ISBLANK(Input!A15), \"\",Input!A15)","v":"18HD03(57)"}]
[null,0,213.95299999997951,1618.6759999999776,0,null,null,610.87633333331905,{"$f":"H14+(SIN((G12)*PI()/180)*$O$1)*ABS(F12)*$O$2","v":632.12945771922534},null,null,null,null,null,null,null,null,null,null,null,null,null,null,null,null,null,null,null,null,null,null,null,"MW108S","HAS","MW133S",null,{"$f":"IF(ISBLANK(Input!A16), \"\",Input!A16)","v":"MW125S"}]
[null,"18HD07","18HD05(65)","18HD06","18HD07",1.9653611435363895E-3,216.32180732157002,null,null,null,null,null,null,null,null,null,null,null,null,null,null,null,null,null,null,null,null,null,null,null,null,null,"MW108S","18HD08(47)","MW125S",null,{"$f":"IF(ISBLANK(Input!A17), \"\",Input!A17)","v":"MW133S"}]
[null,601.29399999999441,235.60499999998137,782.77399999997579,601.29399999999441,null,null,539.89099999998382,{"$f":"H16+(COS(G15*PI()/180)*$O$1)*ABS(F15)*$O$2","v":473.91195129297893},{"$f":"(-1)*$Q$1*F15/$S$1","v":-16.378009529469914},null,null,null,null,null,null,null,null,null,null,null,null,null,null,null,null,null,null,null,null,null,null,"HR6","HR13","18HD08(47)",null,{"$f":"IF(ISBLANK(Input!A18), \"\",Input!A18)","v":"MW132S"}]
[null,0,213.95299999997951,131.10900000005495,0,null,null,115.02066666667815,{"$f":"H17+(SIN((G15)*PI()/180)*$O$1)*ABS(F15)*$O$2","v":66.515563477386195},null,null,null,null,null,null,null,null,null,null,null,null,null,null,null,null,null,null,null,null,null,null,null,"HR6","HAS","MW132S",null,{"$f":"IF(ISBLANK(Input!A19), \"\",Input!A19)","v":""}]
[null,"18HD07","18HD05(65)","18HD08(47)","18HD07",1.2337505739868683E-3,200.52192566306127,null,null,null,null,null,null,null,null,null,null,null,null,null,null,null,null,null,null,null,null,null,null,null,null,null,"HR6","18HD09(62)","MW125S",null,{"$f":"IF(ISBLANK(Input!A20), \"\",Input!A20)","v":""}]
[null,601.29399999999441,235.60499999998137,556.50800000014715,601.29399999999441,null,null,464.46900000004098,{"$f":"H19+(COS(G18*PI()/180)*$O$1)*ABS(F18)*$O$2","v":416.32506563870305},{"$f":"(-1)*$Q$1*F18/$S$1","v":-10.281254783223902},null,null,null,null,null,null,null,null,null,null,null,null,null,null,null,null,null,null,null,null,null,null,"HR13","HAS","18HD08(47)",null,{"$f":"IF(ISBLANK(Input!A21), \"\",Input!A21)","v":""}]
[null,0,213.95299999997951,489.57900000002701,0,null,null,234.51066666666884,{"$f":"H20+(SIN((G18)*PI()/180)*$O$1)*ABS(F18)*$O$2","v":216.48938529851154},null,null,null,null,null,null,null,null,null,null,null,null,null,null,null,null,null,null,null,null,null,null,null,"HR13","18HD06","MW125S",null,{"$f":"IF(ISBLANK(Input!A22), \"\",Input!A22)","v":""}]
[null,"18HD07","18HD05(65)","18HD09(62)","18HD07",1.2524453704200588E-3,201.21474075413221,null,null,null,null,null,null,null,null,null,null,null,null,null,null,null,null,null,null,null,null,null,null,null,null,null,"HR13","HAH","MW132S",null,{"$f":"IF(ISBLANK(Input!A23), \"\",Input!A23)","v":""}]
[null,601.29399999999441,235.60499999998137,451.2160000000149,601.29399999999441,null,null,429.37166666666354,{"$f":"H22+(COS(G21*PI()/180)*$O$1)*ABS(F21)*$O$2","v":380.72299723546956},{"$f":"(-1)*$Q$1*F21/$S$1","v":-10.437044753500491},null,null,null,null,null,null,null,null,null,null,null,null,null,null,null,null,null,null,null,null,null,null,"HAS","18HD08(47)","MW133S",null,{"$f":"IF(ISBLANK(Input!A24), \"\",Input!A24)","v":""}]
[null,0,213.95299999997951,695.53300000005402,0,null,null,303.16200000001118,{"$f":"H23+(SIN((G21)*PI()/180)*$O$1)*ABS(F21)*$O$2","v":284.27802419408732},null,null,null,null,null,null,null,null,null,null,null,null,null,null,null,null,null,null,null,null,null,null,null,"HAS","18HD03(57)","MW132S"]
[null,"18HD07","18HD05(65)","HAH","18HD07",1.2651124128315535E-3,201.66890088645278,null,null,null,null,null,null,null,null,null,null,null,null,null,null,null,null,null,null,null,null,null,null,null,null,null,"18HD06","18HD09(62)","MW132S"]
[null,601.29399999999441,235.60499999998137,470.84499999997206,601.29399999999441,null,null,435.91466666664928,{"$f":"H25+(COS(G24*PI()/180)*$O$1)*ABS(F24)*$O$2","v":386.92671358294984},{"$f":"(-1)*$Q$1*F24/$S$1","v":-10.542603440262946},null,null,null,null,null,null,null,null,null,null,null,null,null,null,null,null,null,null,null,null,null,null,"18HD08(47)","HAH","18HD03(57)"]
[null,0,213.95299999997951,884.9089999999851,0,null,null,366.28733333332156,{"$f":"H26+(SIN((G24)*PI()/180)*$O$1)*ABS(F24)*$O$2","v":346.82345306408007},null,null,null,null,null,null,null,null,null,null,null,null,null,null,null,null,null,null,null,null,null,null,null,"18HD09(62)","MW125S","MW132S"]
[null,"18HD07","18HD05(65)","18HD03(57)","18HD07",1.4052065608015981E-3,206.00769447415405]
[null,601.29399999999441,235.60499999998137,1446.7360000000335,601.29399999999441,null,null,761.21166666666977,{"$f":"H28+(COS(G27*PI()/180)*$O$1)*ABS(F27)*$O$2","v":708.59047691822252},{"$f":"(-1)*$Q$1*F27/$S$1","v":-11.710054673346651}]
[null,0,213.95299999997951,1139.7540000000736,0,null,null,451.23566666668438,{"$f":"H29+(SIN((G27)*PI()/180)*$O$1)*ABS(F27)*$O$2","v":425.56184924937969}]
[null,"18HD07","18HD05(65)","MW125S","18HD07",1.5240630798284789E-3,208.93486492268127]
[null,601.29399999999441,235.60499999998137,1270.5770000000484,601.29399999999441,null,null,702.49200000000803,{"$f":"H31+(COS(G30*PI()/180)*$O$1)*ABS(F30)*$O$2","v":646.91638674031913},{"$f":"(-1)*$Q$1*F30/$S$1","v":-12.700525665237324}]
[null,0,213.95299999997951,498.1260000000475,0,null,null,237.35966666667568,{"$f":"H32+(SIN((G30)*PI()/180)*$O$1)*ABS(F30)*$O$2","v":206.63614123186781}]
[null,"18HD07","18HD05(65)","MW133S","18HD07",1.2606172903704958E-3,201.50910212996547]
[null,601.29399999999441,235.60499999998137,2559.1700000001583,601.29399999999441,null,null,1132.0230000000447,{"$f":"H34+(COS(G33*PI()/180)*$O$1)*ABS(F33)*$O$2","v":1083.1552057696179},{"$f":"(-1)*$Q$1*F33/$S$1","v":-10.505144086420797}]
[null,0,213.95299999997951,830.26100000005681,0,null,null,348.07133333334542,{"$f":"H35+(SIN((G33)*PI()/180)*$O$1)*ABS(F33)*$O$2","v":328.81282887520513}]
[null,"18HD07","18HD05(65)","MW132S","18HD07",1.2642993906640592E-3,201.64010842006172]
[null,601.29399999999441,235.60499999998137,1997.7360000000335,601.29399999999441,null,null,944.8783333333364,{"$f":"H37+(COS(G36*PI()/180)*$O$1)*ABS(F36)*$O$2","v":895.91209368125237},{"$f":"(-1)*$Q$1*F36/$S$1","v":-10.535828255533827}]
[null,0,213.95299999997951,1434.6950000000652,0,null,null,549.54933333334827,{"$f":"H38+(SIN((G36)*PI()/180)*$O$1)*ABS(F36)*$O$2","v":530.12256571525756}]
[null,"18HD07","MW108S","HR6","18HD07",1.8150807839940443E-3,197.2671616079023]
[null,601.29399999999441,0,964.22900000005029,601.29399999999441,null,null,521.8410000000149,{"$f":"H40+(COS(G39*PI()/180)*$O$1)*ABS(F39)*$O$2","v":449.62112281206612},{"$f":"(-1)*$Q$1*F39/$S$1","v":-15.125673199950372}]
[null,0,876.46400000003632,243.02399999997579,0,null,null,373.1626666666707,{"$f":"H41+(SIN((G39)*PI()/180)*$O$1)*ABS(F39)*$O$2","v":350.71407912201607}]
[null,"18HD07","MW108S","HR13","18HD07",1.8463797321618695E-3,197.56728848755341]
[null,601.29399999999441,0,801.62000000011176,601.29399999999441,null,null,467.63800000003539,{"$f":"H43+(COS(G42*PI()/180)*$O$1)*ABS(F42)*$O$2","v":394.29340067597877},{"$f":"(-1)*$Q$1*F42/$S$1","v":-15.38649776801558}]
[null,0,876.46400000003632,551.55300000007264,0,null,null,476.00566666670301,{"$f":"H44+(SIN((G42)*PI()/180)*$O$1)*ABS(F42)*$O$2","v":452.7854687966954}]
[null,"18HD07","MW108S","HAS","18HD07",6.1625434308078969E-4,94.935135896812199]
[null,601.29399999999441,0,296.06099999998696,601.29399999999441,null,null,299.11833333332714,{"$f":"H46+(COS(G45*PI()/180)*$O$1)*ABS(F45)*$O$2","v":296.90937213321956},{"$f":"(-1)*$Q$1*F45/$S$1","v":-5.1354528590065813}]
[null,0,876.46400000003632,1618.6759999999776,0,null,null,831.71333333333803,{"$f":"H47+(SIN((G45)*PI()/180)*$O$1)*ABS(F45)*$O$2","v":857.29540502609564}]
[null,"18HD07","MW108S","18HD06","18HD07",2.050301396958274E-3,199.28938746806128]
[null,601.29399999999441,0,782.77399999997579,601.29399999999441,null,null,461.35599999999005,{"$f":"H49+(COS(G48*PI()/180)*$O$1)*ABS(F48)*$O$2","v":380.72258775669167},{"$f":"(-1)*$Q$1*F48/$S$1","v":-17.085844974652282}]
[null,0,876.46400000003632,131.10900000005495,0,null,null,335.85766666669707,{"$f":"H50+(SIN((G48)*PI()/180)*$O$1)*ABS(F48)*$O$2","v":307.6370130164259}]
[null,"18HD07","MW108S","18HD08(47)","18HD07",1.7113344398738211E-3,196.18976902148651]
[null,601.29399999999441,0,556.50800000014715,601.29399999999441,null,null,385.93400000004721,{"$f":"H52+(COS(G51*PI()/180)*$O$1)*ABS(F51)*$O$2","v":317.4561297717799},{"$f":"(-1)*$Q$1*F51/$S$1","v":-14.261120332281843}]
[null,0,876.46400000003632,489.57900000002701,0,null,null,455.34766666668776,{"$f":"H53+(SIN((G51)*PI()/180)*$O$1)*ABS(F51)*$O$2","v":435.46626537562815}]
[null,"18HD07","MW108S","18HD09(62)","18HD07",1.9052420599981659E-3,198.10382659722984]
[null,601.29399999999441,0,451.2160000000149,601.29399999999441,null,null,350.83666666666977,{"$f":"H55+(COS(G54*PI()/180)*$O$1)*ABS(F54)*$O$2","v":275.38154105972859},{"$f":"(-1)*$Q$1*F54/$S$1","v":-15.877017166651383}]
[null,0,876.46400000003632,695.53300000005402,0,null,null,523.99900000003015,{"$f":"H56+(SIN((G54)*PI()/180)*$O$1)*ABS(F54)*$O$2","v":499.33088551200535}]
[null,"18HD07","MW108S","HAH","18HD07",1.8378098513345308E-3,197.48617531222132]
[null,601.29399999999441,0,470.84499999997206,601.29399999999441,null,null,357.37966666665551,{"$f":"H58+(COS(G57*PI()/180)*$O$1)*ABS(F57)*$O$2","v":284.34284579423871},{"$f":"(-1)*$Q$1*F57/$S$1","v":-15.315082094454423}]
[null,0,876.46400000003632,884.9089999999851,0,null,null,587.12433333334047,{"$f":"H59+(SIN((G57)*PI()/180)*$O$1)*ABS(F57)*$O$2","v":564.11528542067219}]
[null,"18HD07","MW108S","18HD03(57)","18HD07",1.5962318318081181E-3,194.82089705518928]
[null,601.29399999999441,0,1446.7360000000335,601.29399999999441,null,null,682.67666666667594,{"$f":"H61+(COS(G60*PI()/180)*$O$1)*ABS(F60)*$O$2","v":618.3797729090669},{"$f":"(-1)*$Q$1*F60/$S$1","v":-13.301931931734318}]
[null,0,876.46400000003632,1139.7540000000736,0,null,null,672.0726666667033,{"$f":"H62+(SIN((G60)*PI()/180)*$O$1)*ABS(F60)*$O$2","v":655.05960459560447}]
[null,"18HD07","MW108S","MW125S","18HD07",1.6231722315824882E-3,195.1597427989899]
[null,601.29399999999441,0,1270.5770000000484,601.29399999999441,null,null,623.95700000001432,{"$f":"H64+(COS(G63*PI()/180)*$O$1)*ABS(F63)*$O$2","v":558.67839124047555},{"$f":"(-1)*$Q$1*F63/$S$1","v":-13.526435263187402}]
[null,0,876.46400000003632,498.1260000000475,0,null,null,458.19666666669463,{"$f":"H65+(SIN((G63)*PI()/180)*$O$1)*ABS(F63)*$O$2","v":440.51010364136198}]
[null,"18HD07","MW108S","MW133S","18HD07",1.293466375962213E-3,189.95772991084732]
[null,601.29399999999441,0,2559.1700000001583,601.29399999999441,null,null,1053.488000000051,{"$f":"H67+(COS(G66*PI()/180)*$O$1)*ABS(F66)*$O$2","v":1000.4054552604925},{"$f":"(-1)*$Q$1*F66/$S$1","v":-10.778886466351777}]
[null,0,876.46400000003632,830.26100000005681,0,null,null,568.90833333336434,{"$f":"H68+(SIN((G66)*PI()/180)*$O$1)*ABS(F66)*$O$2","v":559.58882259860388}]
[null,"18HD07","MW108S","MW132S","18HD07",1.3915478840894622E-3,191.78468723350545]
[null,601.29399999999441,0,1997.7360000000335,601.29399999999441,null,null,866.34333333334268,{"$f":"H70+(COS(G69*PI()/180)*$O$1)*ABS(F69)*$O$2","v":809.58429801685782},{"$f":"(-1)*$Q$1*F69/$S$1","v":-11.596232367412185}]
[null,0,876.46400000003632,1434.6950000000652,0,null,null,770.38633333336713,{"$f":"H71+(SIN((G69)*PI()/180)*$O$1)*ABS(F69)*$O$2","v":758.54458355060819}]
[null,"18HD07","HR6","HR13","18HD07",1.8027762034130315E-3,198.63951881137024]
[null,601.29399999999441,964.22900000005029,801.62000000011176,601.29399999999441,null,null,789.04766666671878,{"$f":"H73+(COS(G72*PI()/180)*$O$1)*ABS(F72)*$O$2","v":717.87194481753738},{"$f":"(-1)*$Q$1*F72/$S$1","v":-15.02313502844193}]
[null,0,243.02399999997579,551.55300000007264,0,null,null,264.85900000001612,{"$f":"H74+(SIN((G72)*PI()/180)*$O$1)*ABS(F72)*$O$2","v":240.85105816157588}]
[null,"18HD07","HR6","HAS","18HD07",2.2395010308373228E-3,174.78872558844694]
[null,601.29399999999441,964.22900000005029,296.06099999998696,601.29399999999441,null,null,620.52800000001059,{"$f":"H76+(COS(G75*PI()/180)*$O$1)*ABS(F75)*$O$2","v":527.6011602405639},{"$f":"(-1)*$Q$1*F75/$S$1","v":-18.662508590311024}]
[null,0,243.02399999997579,1618.6759999999776,0,null,null,620.56666666665114,{"$f":"H77+(SIN((G75)*PI()/180)*$O$1)*ABS(F75)*$O$2","v":629.0421090980484}]
[null,"18HD07","HR6","18HD08(47)","18HD07",1.8332379898591841E-3,195.45264091741475]
[null,601.29399999999441,964.22900000005029,556.50800000014715,601.29399999999441,null,null,707.34366666673066,{"$f":"H79+(COS(G78*PI()/180)*$O$1)*ABS(F78)*$O$2","v":633.71998755797188},{"$f":"(-1)*$Q$1*F78/$S$1","v":-15.276983248826536}]
[null,0,243.02399999997579,489.57900000002701,0,null,null,244.20100000000093,{"$f":"H80+(SIN((G78)*PI()/180)*$O$1)*ABS(F78)*$O$2","v":223.84886733254604}]
[null,"18HD07","HR6","18HD09(62)","18HD07",1.8045255600499404E-3,198.43595042964978]
[null,601.29399999999441,964.22900000005029,451.2160000000149,601.29399999999441,null,null,672.24633333335316,{"$f":"H82+(COS(G81*PI()/180)*$O$1)*ABS(F81)*$O$2","v":600.91661317106434},{"$f":"(-1)*$Q$1*F81/$S$1","v":-15.037713000416172}]
[null,0,243.02399999997579,695.53300000005402,0,null,null,312.85233333334327,{"$f":"H83+(SIN((G81)*PI()/180)*$O$1)*ABS(F81)*$O$2","v":289.07437445034168}]
[null,"18HD07","HR6","HAH","18HD07",1.8118216574524717E-3,197.6178403918486]
[null,601.29399999999441,964.22900000005029,470.84499999997206,601.29399999999441,null,null,678.78933333333896,{"$f":"H85+(COS(G84*PI()/180)*$O$1)*ABS(F84)*$O$2","v":606.83763213032432},{"$f":"(-1)*$Q$1*F84/$S$1","v":-15.098513812103931}]
[null,0,243.02399999997579,884.9089999999851,0,null,null,375.97766666665365,{"$f":"H86+(SIN((G84)*PI()/180)*$O$1)*ABS(F84)*$O$2","v":353.12858184144829}]
[null,"18HD07","HR13","HAS","18HD07",3.2995233814822962E-3,179.96913900082424]
[null,601.29399999999441,801.62000000011176,296.06099999998696,601.29399999999441,null,null,566.32500000003108,{"$f":"H88+(COS(G87*PI()/180)*$O$1)*ABS(F87)*$O$2","v":428.84487904766786},{"$f":"(-1)*$Q$1*F87/$S$1","v":-27.496028179019135}]
[null,0,551.55300000007264,1618.6759999999776,0,null,null,723.40966666668339,{"$f":"H89+(SIN((G87)*PI()/180)*$O$1)*ABS(F87)*$O$2","v":723.48371704780664}]
[null,"18HD07","HR13","18HD06","18HD07",2.1579375546164521E-3,191.45207453170821]
[null,601.29399999999441,801.62000000011176,782.77399999997579,601.29399999999441,null,null,728.56266666669399,{"$f":"H91+(COS(G90*PI()/180)*$O$1)*ABS(F90)*$O$2","v":640.43868980858213},{"$f":"(-1)*$Q$1*F90/$S$1","v":-17.982812955137103}]
[null,0,551.55300000007264,131.10900000005495,0,null,null,227.55400000004252,{"$f":"H92+(SIN((G90)*PI()/180)*$O$1)*ABS(F90)*$O$2","v":209.70172431325315}]
[null,"18HD07","HR13","18HD08(47)","18HD07",1.977727690667726E-3,194.69839522164818]
[null,601.29399999999441,801.62000000011176,556.50800000014715,601.29399999999441,null,null,653.14066666675114,{"$f":"H94+(COS(G93*PI()/180)*$O$1)*ABS(F93)*$O$2","v":573.43207188555209},{"$f":"(-1)*$Q$1*F93/$S$1","v":-16.481064088897718}]
[null,0,551.55300000007264,489.57900000002701,0,null,null,347.04400000003324,{"$f":"H95+(SIN((G93)*PI()/180)*$O$1)*ABS(F93)*$O$2","v":326.13522778439483}]
[null,"18HD07","HR13","18HD09(62)","18HD07",1.8118625736481026E-3,198.4105015484582]
[null,601.29399999999441,801.62000000011176,451.2160000000149,601.29399999999441,null,null,618.04333333337365,{"$f":"H97+(COS(G96*PI()/180)*$O$1)*ABS(F96)*$O$2","v":546.4129966781461},{"$f":"(-1)*$Q$1*F96/$S$1","v":-15.098854780400854}]
[null,0,551.55300000007264,695.53300000005402,0,null,null,415.69533333337557,{"$f":"H98+(SIN((G96)*PI()/180)*$O$1)*ABS(F96)*$O$2","v":391.85250920011453}]
[null,"18HD07","HR13","HAH","18HD07",1.8529609435280784E-3,197.41114065791413]
[null,601.29399999999441,801.62000000011176,470.84499999997206,601.29399999999441,null,null,624.58633333335945,{"$f":"H100+(COS(G99*PI()/180)*$O$1)*ABS(F99)*$O$2","v":550.91707149639331},{"$f":"(-1)*$Q$1*F99/$S$1","v":-15.44134119606732}]
[null,0,551.55300000007264,884.9089999999851,0,null,null,478.8206666666859,{"$f":"H101+(SIN((G99)*PI()/180)*$O$1)*ABS(F99)*$O$2","v":455.71838736938139}]
[null,"18HD07","HR13","MW125S","18HD07",1.5304412399724354E-3,207.33821293359239]
[null,601.29399999999441,801.62000000011176,1270.5770000000484,601.29399999999441,null,null,891.1636666667182,{"$f":"H103+(COS(G102*PI()/180)*$O$1)*ABS(F102)*$O$2","v":834.51749972543553},{"$f":"(-1)*$Q$1*F102/$S$1","v":-12.753676999770295}]
[null,0,551.55300000007264,498.1260000000475,0,null,null,349.89300000004005,{"$f":"H104+(SIN((G102)*PI()/180)*$O$1)*ABS(F102)*$O$2","v":320.60787243975642}]
[null,"18HD07","HR13","MW133S","18HD07",1.3116261222852882E-3,219.07698378130672]
[null,601.29399999999441,801.62000000011176,2559.1700000001583,601.29399999999441,null,null,1320.6946666667548,{"$f":"H106+(COS(G105*PI()/180)*$O$1)*ABS(F105)*$O$2","v":1278.2690435268075},{"$f":"(-1)*$Q$1*F105/$S$1","v":-10.930217685710735}]
[null,0,551.55300000007264,830.26100000005681,0,null,null,460.60466666670982,{"$f":"H107+(SIN((G105)*PI()/180)*$O$1)*ABS(F105)*$O$2","v":426.15458731102797}]
[null,"18HD07","HAS","18HD03(57)","18HD07",2.3470436004415203E-3,175.53471611924684]
[null,601.29399999999441,296.06099999998696,1446.7360000000335,601.29399999999441,null,null,781.36366666667163,{"$f":"H109+(COS(G108*PI()/180)*$O$1)*ABS(F108)*$O$2","v":683.86701685985543},{"$f":"(-1)*$Q$1*F108/$S$1","v":-19.558696670346002}]
[null,0,1618.6759999999776,1139.7540000000736,0,null,null,919.47666666668374,{"$f":"H110+(SIN((G108)*PI()/180)*$O$1)*ABS(F108)*$O$2","v":927.09038208769505}]
[null,"18HD07","HAS","MW125S","18HD07",2.0716262801258756E-3,173.46251680714013]
[null,601.29399999999441,296.06099999998696,1270.5770000000484,601.29399999999441,null,null,722.6440000000099,{"$f":"H112+(COS(G111*PI()/180)*$O$1)*ABS(F111)*$O$2","v":636.88751224135422},{"$f":"(-1)*$Q$1*F111/$S$1","v":-17.2635523343823}]
[null,0,1618.6759999999776,498.1260000000475,0,null,null,705.60066666667501,{"$f":"H113+(SIN((G111)*PI()/180)*$O$1)*ABS(F111)*$O$2","v":715.42821912639022}]
[null,"18HD07","HAS","MW133S","18HD07",1.549957220543217E-3,167.37554910803863]
[null,601.29399999999441,296.06099999998696,2559.1700000001583,601.29399999999441,null,null,1152.1750000000466,{"$f":"H115+(COS(G114*PI()/180)*$O$1)*ABS(F114)*$O$2","v":1089.1547997926725},{"$f":"(-1)*$Q$1*F114/$S$1","v":-12.916310171193475}]
[null,0,1618.6759999999776,830.26100000005681,0,null,null,816.31233333334478,{"$f":"H116+(SIN((G114)*PI()/180)*$O$1)*ABS(F114)*$O$2","v":830.42725723623539}]
[null,"18HD07","HAS","MW132S","18HD07",1.9404441172764532E-3,172.25826876695641]
[null,601.29399999999441,296.06099999998696,1997.7360000000335,601.29399999999441,null,null,965.03033333333826,{"$f":"H118+(COS(G117*PI()/180)*$O$1)*ABS(F117)*$O$2","v":884.91543145185642},{"$f":"(-1)*$Q$1*F117/$S$1","v":-16.170367643970444}]
[null,0,1618.6759999999776,1434.6950000000652,0,null,null,1017.7903333333476,{"$f":"H119+(SIN((G117)*PI()/180)*$O$1)*ABS(F117)*$O$2","v":1028.6817170860988}]
[null,"18HD07","18HD06","18HD08(47)","18HD07",2.1162627955339263E-3,194.0732098272502]
[null,601.29399999999441,782.77399999997579,556.50800000014715,601.29399999999441,null,null,646.85866666670574,{"$f":"H121+(COS(G120*PI()/180)*$O$1)*ABS(F120)*$O$2","v":561.32762921827111},{"$f":"(-1)*$Q$1*F120/$S$1","v":-17.635523296116055}]
[null,0,131.10900000005495,489.57900000002701,0,null,null,206.89600000002733,{"$f":"H122+(SIN((G120)*PI()/180)*$O$1)*ABS(F120)*$O$2","v":185.45459889863545}]
[null,"18HD07","18HD06","18HD09(62)","18HD07",2.0689407637559439E-3,197.63334105453117]
[null,601.29399999999441,782.77399999997579,451.2160000000149,601.29399999999441,null,null,611.76133333332837,{"$f":"H124+(COS(G123*PI()/180)*$O$1)*ABS(F123)*$O$2","v":529.60588919914005},{"$f":"(-1)*$Q$1*F123/$S$1","v":-17.241173031299535}]
[null,0,131.10900000005495,695.53300000005402,0,null,null,275.54733333336964,{"$f":"H125+(SIN((G123)*PI()/180)*$O$1)*ABS(F123)*$O$2","v":249.43346371405582}]
[null,"18HD07","18HD06","HAH","18HD07",2.0841453521081017E-3,196.40300331946005]
[null,601.29399999999441,782.77399999997579,470.84499999997206,601.29399999999441,null,null,618.30433333331405,{"$f":"H127+(COS(G126*PI()/180)*$O$1)*ABS(F126)*$O$2","v":534.99937859447721},{"$f":"(-1)*$Q$1*F126/$S$1","v":-17.367877934234183}]
[null,0,131.10900000005495,884.9089999999851,0,null,null,338.67266666668002,{"$f":"H128+(SIN((G126)*PI()/180)*$O$1)*ABS(F126)*$O$2","v":314.14994017834266}]
[null,"18HD07","18HD08(47)","18HD03(57)","18HD07",1.5421738773886422E-3,197.40979633215562]
[null,601.29399999999441,556.50800000014715,1446.7360000000335,601.29399999999441,null,null,868.1793333333917,{"$f":"H130+(COS(G129*PI()/180)*$O$1)*ABS(F129)*$O$2","v":806.86576519408254},{"$f":"(-1)*$Q$1*F129/$S$1","v":-12.851448978238684}]
[null,0,489.57900000002701,1139.7540000000736,0,null,null,543.11100000003353,{"$f":"H131+(SIN((G129)*PI()/180)*$O$1)*ABS(F129)*$O$2","v":523.88497901197945}]
[null,"18HD07","18HD08(47)","MW125S","18HD07",1.6044112663485695E-3,196.93037396845813]
[null,601.29399999999441,556.50800000014715,1270.5770000000484,601.29399999999441,null,null,809.45966666672996,{"$f":"H133+(COS(G132*PI()/180)*$O$1)*ABS(F132)*$O$2","v":745.50654064208004},{"$f":"(-1)*$Q$1*F132/$S$1","v":-13.370093886238079}]
[null,0,489.57900000002701,498.1260000000475,0,null,null,329.23500000002485,{"$f":"H134+(SIN((G132)*PI()/180)*$O$1)*ABS(F132)*$O$2","v":309.76751596007335}]
[null,"18HD07","18HD08(47)","MW133S","18HD07",1.2617136477319157E-3,200.17493965095892]
[null,601.29399999999441,556.50800000014715,2559.1700000001583,601.29399999999441,null,null,1238.9906666667666,{"$f":"H136+(COS(G135*PI()/180)*$O$1)*ABS(F135)*$O$2","v":1189.6448376452122},{"$f":"(-1)*$Q$1*F135/$S$1","v":-10.514280397765965}]
[null,0,489.57900000002701,830.26100000005681,0,null,null,439.94666666669463,{"$f":"H137+(SIN((G135)*PI()/180)*$O$1)*ABS(F135)*$O$2","v":421.8154376612834}]
[null,"18HD07","18HD08(47)","MW132S","18HD07",1.2819757067083874E-3,199.93330390728215]
[null,601.29399999999441,556.50800000014715,1997.7360000000335,601.29399999999441,null,null,1051.8460000000584,{"$f":"H139+(COS(G138*PI()/180)*$O$1)*ABS(F138)*$O$2","v":1001.630471098389},{"$f":"(-1)*$Q$1*F138/$S$1","v":-10.683130889236562}]
[null,0,489.57900000002701,1434.6950000000652,0,null,null,641.42466666669736,{"$f":"H140+(SIN((G138)*PI()/180)*$O$1)*ABS(F138)*$O$2","v":623.21387873647302}]
[null,"18HD07","18HD09(62)","18HD03(57)","18HD07",1.4995116421365358E-3,199.71599063936696]
[null,601.29399999999441,451.2160000000149,1446.7360000000335,601.29399999999441,null,null,833.08200000001432,{"$f":"H142+(COS(G141*PI()/180)*$O$1)*ABS(F141)*$O$2","v":774.26512857848115},{"$f":"(-1)*$Q$1*F141/$S$1","v":-12.495930351137799}]
[null,0,695.53300000005402,1139.7540000000736,0,null,null,611.76233333337586,{"$f":"H143+(SIN((G141)*PI()/180)*$O$1)*ABS(F141)*$O$2","v":590.68432299807614}]
[null,"18HD07","18HD09(62)","MW125S","18HD07",1.5821288875656611E-3,199.32016282036889]
[null,601.29399999999441,451.2160000000149,1270.5770000000484,601.29399999999441,null,null,774.36233333335258,{"$f":"H145+(COS(G144*PI()/180)*$O$1)*ABS(F144)*$O$2","v":712.15272337871636},{"$f":"(-1)*$Q$1*F144/$S$1","v":-13.184407396380509}]
[null,0,695.53300000005402,498.1260000000475,0,null,null,397.88633333336719,{"$f":"H146+(SIN((G144)*PI()/180)*$O$1)*ABS(F144)*$O$2","v":376.07625792920254}]
[null,"18HD07","18HD09(62)","MW133S","18HD07",1.2608421183719265E-3,201.15404858550789]
[null,601.29399999999441,451.2160000000149,2559.1700000001583,601.29399999999441,null,null,1203.8933333333891,{"$f":"H148+(COS(G147*PI()/180)*$O$1)*ABS(F147)*$O$2","v":1154.8983994532366},{"$f":"(-1)*$Q$1*F147/$S$1","v":-10.507017653099389}]
[null,0,695.53300000005402,830.26100000005681,0,null,null,508.59800000003696,{"$f":"H149+(SIN((G147)*PI()/180)*$O$1)*ABS(F147)*$O$2","v":489.63930929780128}]
[null,"18HD07","18HD09(62)","MW132S","18HD07",1.2698195862723329E-3,201.090057787875]
[null,601.29399999999441,451.2160000000149,1997.7360000000335,601.29399999999441,null,null,1016.7486666666809,{"$f":"H151+(COS(G150*PI()/180)*$O$1)*ABS(F150)*$O$2","v":967.38358428666743},{"$f":"(-1)*$Q$1*F150/$S$1","v":-10.581829885602774}]
[null,0,695.53300000005402,1434.6950000000652,0,null,null,710.0760000000397,{"$f":"H152+(SIN((G150)*PI()/180)*$O$1)*ABS(F150)*$O$2","v":691.03744084209961}]
[null,"18HD07","HAH","18HD03(57)","18HD07",1.5026003897552574E-3,199.53990885182176]
[null,601.29399999999441,470.84499999997206,1446.7360000000335,601.29399999999441,null,null,839.625,{"$f":"H154+(COS(G153*PI()/180)*$O$1)*ABS(F153)*$O$2","v":780.62234339382758},{"$f":"(-1)*$Q$1*F153/$S$1","v":-12.521669914627145}]
[null,0,884.9089999999851,1139.7540000000736,0,null,null,674.88766666668619,{"$f":"H155+(SIN((G153)*PI()/180)*$O$1)*ABS(F153)*$O$2","v":653.94746729595295}]
[null,"18HD07","HAH","MW125S","18HD07",1.5853525705776244E-3,198.95080916674397]
[null,601.29399999999441,470.84499999997206,1270.5770000000484,601.29399999999441,null,null,780.90533333333826,{"$f":"H157+(COS(G156*PI()/180)*$O$1)*ABS(F156)*$O$2","v":718.42938000035895},{"$f":"(-1)*$Q$1*F156/$S$1","v":-13.211271421480204}]
[null,0,884.9089999999851,498.1260000000475,0,null,null,461.01166666667751,{"$f":"H158+(SIN((G156)*PI()/180)*$O$1)*ABS(F156)*$O$2","v":439.55945071037405}]
[null,"18HD07","HAH","MW133S","18HD07",1.2605075084467475E-3,201.71832015508417]
[null,601.29399999999441,470.84499999997206,2559.1700000001583,601.29399999999441,null,null,1210.4363333333749,{"$f":"H160+(COS(G159*PI()/180)*$O$1)*ABS(F159)*$O$2","v":1161.6434375476647},{"$f":"(-1)*$Q$1*F159/$S$1","v":-10.504229237056229}]
[null,0,884.9089999999851,830.26100000005681,0,null,null,571.72333333334734,{"$f":"H161+(SIN((G159)*PI()/180)*$O$1)*ABS(F159)*$O$2","v":552.28820746649251}]
[null,"18HD07","HAH","MW132S","18HD07",1.2638853809609388E-3,201.68203306464108]
[null,601.29399999999441,470.84499999997206,1997.7360000000335,601.29399999999441,null,null,1023.2916666666666,{"$f":"H163+(COS(G162*PI()/180)*$O$1)*ABS(F162)*$O$2","v":974.35568504820992},{"$f":"(-1)*$Q$1*F162/$S$1","v":-10.53237817467449}]
[null,0,884.9089999999851,1434.6950000000652,0,null,null,773.20133333335014,{"$f":"H164+(SIN((G162)*PI()/180)*$O$1)*ABS(F162)*$O$2","v":753.74511444588234}]
[null,"18HD07","18HD03(57)","MW125S","18HD07",1.6597720290051395E-3,192.15131178492592]
[null,601.29399999999441,1446.7360000000335,1270.5770000000484,601.29399999999441,null,null,1106.2023333333589,{"$f":"H166+(COS(G165*PI()/180)*$O$1)*ABS(F165)*$O$2","v":1038.594623590953},{"$f":"(-1)*$Q$1*F165/$S$1","v":-13.83143357504283}]
[null,0,1139.7540000000736,498.1260000000475,0,null,null,545.9600000000404,{"$f":"H167+(SIN((G165)*PI()/180)*$O$1)*ABS(F165)*$O$2","v":531.40282129305319}]
[null,"18HD07","18HD03(57)","MW133S","18HD07",1.2995871050036096E-3,217.1217467151414]
[null,601.29399999999441,1446.7360000000335,2559.1700000001583,601.29399999999441,null,null,1535.7333333333954,{"$f":"H169+(COS(G168*PI()/180)*$O$1)*ABS(F168)*$O$2","v":1492.5569926804112},{"$f":"(-1)*$Q$1*F168/$S$1","v":-10.829892541696747}]
[null,0,1139.7540000000736,830.26100000005681,0,null,null,656.67166666671017,{"$f":"H170+(SIN((G168)*PI()/180)*$O$1)*ABS(F168)*$O$2","v":623.99188821833445}]
[null,"18HD07","MW133S","MW132S","18HD07",1.2603708609876126E-3,202.04186111525826]
[null,601.29399999999441,2559.1700000001583,1997.7360000000335,601.29399999999441,null,null,1719.4000000000622,{"$f":"H172+(COS(G171*PI()/180)*$O$1)*ABS(F171)*$O$2","v":1670.7229063911357},{"$f":"(-1)*$Q$1*F171/$S$1","v":-10.503090508230105}]
[null,0,830.26100000005681,1434.6950000000652,0,null,null,754.985333333374,{"$f":"H173+(SIN((G171)*PI()/180)*$O$1)*ABS(F171)*$O$2","v":735.27712911813308}]
[null,"18HD05(65)","MW108S","HR6","18HD05(65)",1.4986679082316515E-3,186.41214105344125]
[null,235.60499999998137,0,964.22900000005029,235.60499999998137,null,null,399.94466666667722,{"$f":"H175+(COS(G174*PI()/180)*$O$1)*ABS(F174)*$O$2","v":337.89080599680693},{"$f":"(-1)*$Q$1*F174/$S$1","v":-12.488899235263762}]
[null,213.95299999997951,876.46400000003632,243.02399999997579,213.95299999997951,null,null,444.48033333333052,{"$f":"H176+(SIN((G174)*PI()/180)*$O$1)*ABS(F174)*$O$2","v":437.50656256862783}]
[null,"18HD05(65)","MW108S","HR13","18HD05(65)",1.6353535846290756E-3,187.52975261448495]
[null,235.60499999998137,0,801.62000000011176,235.60499999998137,null,null,345.74166666669771,{"$f":"H178+(COS(G177*PI()/180)*$O$1)*ABS(F177)*$O$2","v":278.18950643745683},{"$f":"(-1)*$Q$1*F177/$S$1","v":-13.627946538575632}]
[null,213.95299999997951,876.46400000003632,551.55300000007264,213.95299999997951,null,null,547.32333333336283,{"$f":"H179+(SIN((G177)*PI()/180)*$O$1)*ABS(F177)*$O$2","v":538.39423372478768}]
[null,"18HD05(65)","MW108S","HAS","18HD05(65)",5.6138569157225147E-4,57.021012998124242]
[null,235.60499999998137,0,296.06099999998696,235.60499999998137,null,null,177.22199999998944,{"$f":"H181+(COS(G180*PI()/180)*$O$1)*ABS(F180)*$O$2","v":189.95449459486457},{"$f":"(-1)*$Q$1*F180/$S$1","v":-4.6782140964354291}]
[null,213.95299999997951,876.46400000003632,1618.6759999999776,213.95299999997951,null,null,903.03099999999779,{"$f":"H182+(SIN((G180)*PI()/180)*$O$1)*ABS(F180)*$O$2","v":922.65307327714299}]
[null,"18HD05(65)","MW108S","18HD06","18HD05(65)",1.4367998681990601E-3,185.83440232090646]
[null,235.60499999998137,0,782.77399999997579,235.60499999998137,null,null,339.45966666665237,{"$f":"H184+(COS(G183*PI()/180)*$O$1)*ABS(F183)*$O$2","v":279.90312366394539},{"$f":"(-1)*$Q$1*F183/$S$1","v":-11.973332234992167}]
[null,213.95299999997951,876.46400000003632,131.10900000005495,213.95299999997951,null,null,407.17533333335695,{"$f":"H185+(SIN((G183)*PI()/180)*$O$1)*ABS(F183)*$O$2","v":401.08966937580215}]
[null,"18HD05(65)","MW108S","18HD08(47)","18HD05(65)",1.4148043456160282E-3,185.61646113181646]
[null,235.60499999998137,0,556.50800000014715,235.60499999998137,null,null,264.03766666670953,{"$f":"H187+(COS(G186*PI()/180)*$O$1)*ABS(F186)*$O$2","v":205.37048636311687},{"$f":"(-1)*$Q$1*F186/$S$1","v":-11.790036213466902}]
[null,213.95299999997951,876.46400000003632,489.57900000002701,213.95299999997951,null,null,526.66533333334758,{"$f":"H188+(SIN((G186)*PI()/180)*$O$1)*ABS(F186)*$O$2","v":520.89594834902948}]
[null,"18HD05(65)","MW108S","18HD09(62)","18HD05(65)",1.6816332802038637E-3,187.86605550793553]
[null,235.60499999998137,0,451.2160000000149,235.60499999998137,null,null,228.94033333333209,{"$f":"H190+(COS(G189*PI()/180)*$O$1)*ABS(F189)*$O$2","v":159.53157010071777},{"$f":"(-1)*$Q$1*F189/$S$1","v":-14.013610668365532}]
[null,213.95299999997951,876.46400000003632,695.53300000005402,213.95299999997951,null,null,595.31666666668991,{"$f":"H191+(SIN((G189)*PI()/180)*$O$1)*ABS(F189)*$O$2","v":585.72731394442076}]
[null,"18HD05(65)","MW108S","HAH","18HD05(65)",1.7776281828552928E-3,188.50667231442773]
[null,235.60499999998137,0,470.84499999997206,235.60499999998137,null,null,235.4833333333178,{"$f":"H193+(COS(G192*PI()/180)*$O$1)*ABS(F192)*$O$2","v":162.23033909119204},{"$f":"(-1)*$Q$1*F192/$S$1","v":-14.813568190460774}]
[null,213.95299999997951,876.46400000003632,884.9089999999851,213.95299999997951,null,null,658.44200000000035,{"$f":"H194+(SIN((G192)*PI()/180)*$O$1)*ABS(F192)*$O$2","v":647.48554537731911}]
[null,"18HD05(65)","MW108S","18HD03(57)","18HD05(65)",1.5936361035713401E-3,187.20947164189769]
[null,235.60499999998137,0,1446.7360000000335,235.60499999998137,null,null,560.78033333333826,{"$f":"H196+(COS(G195*PI()/180)*$O$1)*ABS(F195)*$O$2","v":494.90380138576359},{"$f":"(-1)*$Q$1*F195/$S$1","v":-13.280300863094501}]
[null,213.95299999997951,876.46400000003632,1139.7540000000736,213.95299999997951,null,null,743.39033333336317,{"$f":"H197+(SIN((G195)*PI()/180)*$O$1)*ABS(F195)*$O$2","v":735.0571278326039}]
[null,"18HD05(65)","MW108S","MW125S","18HD05(65)",1.4996336972103389E-3,186.42077145523402]
[null,235.60499999998137,0,1270.5770000000484,235.60499999998137,null,null,502.06066666667658,{"$f":"H199+(COS(G198*PI()/180)*$O$1)*ABS(F198)*$O$2","v":439.96786836020487},{"$f":"(-1)*$Q$1*F198/$S$1","v":-12.496947476752824}]
[null,213.95299999997951,876.46400000003632,498.1260000000475,213.95299999997951,null,null,529.51433333335444,{"$f":"H200+(SIN((G198)*PI()/180)*$O$1)*ABS(F198)*$O$2","v":522.52671539948085}]
[null,"18HD05(65)","MW108S","MW133S","18HD05(65)",1.2747437581641043E-3,184.04597098204806]
[null,235.60499999998137,0,2559.1700000001583,235.60499999998137,null,null,931.59166666671319,{"$f":"H202+(COS(G201*PI()/180)*$O$1)*ABS(F201)*$O$2","v":878.60971702890879},{"$f":"(-1)*$Q$1*F201/$S$1","v":-10.622864651367536}]
[null,213.95299999997951,876.46400000003632,830.26100000005681,213.95299999997951,null,null,640.22600000002421,{"$f":"H203+(SIN((G201)*PI()/180)*$O$1)*ABS(F201)*$O$2","v":636.47842110038744}]
[null,"18HD05(65)","MW108S","MW132S","18HD05(65)",1.4100528827217865E-3,185.56846096328806]
[null,235.60499999998137,0,1997.7360000000335,235.60499999998137,null,null,744.447000000005,{"$f":"H205+(COS(G204*PI()/180)*$O$1)*ABS(F204)*$O$2","v":685.97205027614348},{"$f":"(-1)*$Q$1*F204/$S$1","v":-11.750440689348221}]
[null,213.95299999997951,876.46400000003632,1434.6950000000652,213.95299999997951,null,null,841.70400000002701,{"$f":"H206+(SIN((G204)*PI()/180)*$O$1)*ABS(F204)*$O$2","v":836.00297687789191}]
[null,"18HD05(65)","HR6","HR13","18HD05(65)",1.5462147628171326E-3,197.10443211297215]
[null,235.60499999998137,964.22900000005029,801.62000000011176,235.60499999998137,null,null,667.1513333333811,{"$f":"H208+(COS(G207*PI()/180)*$O$1)*ABS(F207)*$O$2","v":605.57524600579984},{"$f":"(-1)*$Q$1*F207/$S$1","v":-12.885123023476106}]
[null,213.95299999997951,243.02399999997579,551.55300000007264,213.95299999997951,null,null,336.176666666676,{"$f":"H209+(SIN((G207)*PI()/180)*$O$1)*ABS(F207)*$O$2","v":317.22817457155321}]
[null,"18HD05(65)","HR6","HAS","18HD05(65)",1.6142620536732895E-3,160.10204215388904]
[null,235.60499999998137,964.22900000005029,296.06099999998696,235.60499999998137,null,null,498.63166666667286,{"$f":"H211+(COS(G210*PI()/180)*$O$1)*ABS(F210)*$O$2","v":435.38620724686507},{"$f":"(-1)*$Q$1*F210/$S$1","v":-13.452183780610747}]
[null,213.95299999997951,243.02399999997579,1618.6759999999776,213.95299999997951,null,null,691.88433333331102,{"$f":"H212+(SIN((G210)*PI()/180)*$O$1)*ABS(F210)*$O$2","v":714.77632045677012}]
[null,"18HD05(65)","HR6","18HD06","18HD05(65)",1.5485533009985915E-3,197.42801019827749]
[null,235.60499999998137,964.22900000005029,782.77399999997579,235.60499999998137,null,null,660.86933333333582,{"$f":"H214+(COS(G213*PI()/180)*$O$1)*ABS(F213)*$O$2","v":599.30827300841963},{"$f":"(-1)*$Q$1*F213/$S$1","v":-12.904610841654929}]
[null,213.95299999997951,243.02399999997579,131.10900000005495,213.95299999997951,null,null,196.02866666667009,{"$f":"H215+(SIN((G213)*PI()/180)*$O$1)*ABS(F213)*$O$2","v":176.70354374245616}]
[null,"18HD05(65)","HR6","18HD08(47)","18HD05(65)",1.4949400759288361E-3,181.44946312085702]
[null,235.60499999998137,964.22900000005029,556.50800000014715,235.60499999998137,null,null,585.44733333339298,{"$f":"H217+(COS(G216*PI()/180)*$O$1)*ABS(F216)*$O$2","v":523.17809447416369},{"$f":"(-1)*$Q$1*F216/$S$1","v":-12.457833966073634}]
[null,213.95299999997951,243.02399999997579,489.57900000002701,213.95299999997951,null,null,315.51866666666075,{"$f":"H218+(SIN((G216)*PI()/180)*$O$1)*ABS(F216)*$O$2","v":313.94304931187816}]
[null,"18HD05(65)","HR6","18HD09(62)","18HD05(65)",1.5159344788378787E-3,191.86760741986885]
[null,235.60499999998137,964.22900000005029,451.2160000000149,235.60499999998137,null,null,550.35000000001548,{"$f":"H220+(COS(G219*PI()/180)*$O$1)*ABS(F219)*$O$2","v":488.53616677303893},{"$f":"(-1)*$Q$1*F219/$S$1","v":-12.632787323648989}]
[null,213.95299999997951,243.02399999997579,695.53300000005402,213.95299999997951,null,null,384.17000000000309,{"$f":"H221+(SIN((G219)*PI()/180)*$O$1)*ABS(F219)*$O$2","v":371.18027671960965}]
[null,"18HD05(65)","HR6","HAH","18HD05(65)",1.5246930841275148E-3,193.65272065574433]
[null,235.60499999998137,964.22900000005029,470.84499999997206,235.60499999998137,null,null,556.89300000000128,{"$f":"H223+(COS(G222*PI()/180)*$O$1)*ABS(F222)*$O$2","v":495.15917929621185},{"$f":"(-1)*$Q$1*F222/$S$1","v":-12.705775701062624}]
[null,213.95299999997951,243.02399999997579,884.9089999999851,213.95299999997951,null,null,447.29533333331347,{"$f":"H224+(SIN((G222)*PI()/180)*$O$1)*ABS(F222)*$O$2","v":432.30020794353379}]
[null,"18HD05(65)","HR6","18HD03(57)","18HD05(65)",1.5188007324889936E-3,192.48817168622227]
[null,235.60499999998137,964.22900000005029,1446.7360000000335,235.60499999998137,null,null,882.19000000002177,{"$f":"H226+(COS(G225*PI()/180)*$O$1)*ABS(F225)*$O$2","v":820.40387821351987},{"$f":"(-1)*$Q$1*F225/$S$1","v":-12.656672770741613}]
[null,213.95299999997951,243.02399999997579,1139.7540000000736,213.95299999997951,null,null,532.24366666667629,{"$f":"H227+(SIN((G225)*PI()/180)*$O$1)*ABS(F225)*$O$2","v":518.55939484738076}]
[null,"18HD05(65)","HR6","MW125S","18HD05(65)",1.4989891038583775E-3,186.57891301986427]
[null,235.60499999998137,964.22900000005029,1270.5770000000484,235.60499999998137,null,null,823.47033333336003,{"$f":"H229+(COS(G228*PI()/180)*$O$1)*ABS(F228)*$O$2","v":761.42373917419081},{"$f":"(-1)*$Q$1*F228/$S$1","v":-12.49157586548648}]
[null,213.95299999997951,243.02399999997579,498.1260000000475,213.95299999997951,null,null,318.36766666666762,{"$f":"H230+(SIN((G228)*PI()/180)*$O$1)*ABS(F228)*$O$2","v":311.21177096260266}]
[null,"18HD05(65)","HR6","MW132S","18HD05(65)",1.4958389397162655E-3,180.12998373177521]
[null,235.60499999998137,964.22900000005029,1997.7360000000335,235.60499999998137,null,null,1065.8566666666884,{"$f":"H232+(COS(G231*PI()/180)*$O$1)*ABS(F231)*$O$2","v":1003.5302045680901},{"$f":"(-1)*$Q$1*F231/$S$1","v":-12.465324497635546}]
[null,213.95299999997951,243.02399999997579,1434.6950000000652,213.95299999997951,null,null,630.55733333334013,{"$f":"H233+(SIN((G231)*PI()/180)*$O$1)*ABS(F231)*$O$2","v":630.41593653065308}]
[null,"18HD05(65)","HR13","HAS","18HD05(65)",2.1688499489420712E-3,164.65088817818184]
[null,235.60499999998137,801.62000000011176,296.06099999998696,235.60499999998137,null,null,444.42866666669335,{"$f":"H235+(COS(G234*PI()/180)*$O$1)*ABS(F234)*$O$2","v":357.28329233194449},{"$f":"(-1)*$Q$1*F234/$S$1","v":-18.073749574517262}]
[null,213.95299999997951,551.55300000007264,1618.6759999999776,213.95299999997951,null,null,794.72733333334327,{"$f":"H236+(SIN((G234)*PI()/180)*$O$1)*ABS(F234)*$O$2","v":818.64791702428965}]
[null,"18HD05(65)","HR13","18HD06","18HD05(65)",1.5455789021586877E-3,197.20139397894067]
[null,235.60499999998137,801.62000000011176,782.77399999997579,235.60499999998137,null,null,606.66633333335631,{"$f":"H238+(COS(G237*PI()/180)*$O$1)*ABS(F237)*$O$2","v":545.14770990918169},{"$f":"(-1)*$Q$1*F237/$S$1","v":-12.879824184655732}]
[null,213.95299999997951,551.55300000007264,131.10900000005495,213.95299999997951,null,null,298.87166666670237,{"$f":"H239+(SIN((G237)*PI()/180)*$O$1)*ABS(F237)*$O$2","v":279.82683146957703}]
[null,"18HD05(65)","HR13","18HD09(62)","18HD05(65)",1.6137210797631224E-3,189.38463052186071]
[null,235.60499999998137,801.62000000011176,451.2160000000149,235.60499999998137,null,null,496.14700000003603,{"$f":"H241+(COS(G240*PI()/180)*$O$1)*ABS(F240)*$O$2","v":429.80854430261979},{"$f":"(-1)*$Q$1*F240/$S$1","v":-13.447675664692687}]
[null,213.95299999997951,551.55300000007264,695.53300000005402,213.95299999997951,null,null,487.01300000003539,{"$f":"H242+(SIN((G240)*PI()/180)*$O$1)*ABS(F240)*$O$2","v":476.04902192402955}]
[null,"18HD05(65)","HR13","HAH","18HD05(65)",1.584517652588074E-3,192.26015267250472]
[null,235.60499999998137,801.62000000011176,470.84499999997206,235.60499999998137,null,null,502.69000000002171,{"$f":"H244+(COS(G243*PI()/180)*$O$1)*ABS(F243)*$O$2","v":438.17415246468579},{"$f":"(-1)*$Q$1*F243/$S$1","v":-13.204313771567284}]
[null,213.95299999997951,551.55300000007264,884.9089999999851,213.95299999997951,null,null,550.13833333334571,{"$f":"H245+(SIN((G243)*PI()/180)*$O$1)*ABS(F243)*$O$2","v":536.11859826996704}]
[null,"18HD05(65)","HR13","MW125S","18HD05(65)",1.5074538887624583E-3,206.01192262670145]
[null,235.60499999998137,801.62000000011176,1270.5770000000484,235.60499999998137,null,null,769.26733333338052,{"$f":"H247+(COS(G246*PI()/180)*$O$1)*ABS(F246)*$O$2","v":712.81928997375451},{"$f":"(-1)*$Q$1*F246/$S$1","v":-12.562115739687155}]
[null,213.95299999997951,551.55300000007264,498.1260000000475,213.95299999997951,null,null,421.21066666669986,{"$f":"H248+(SIN((G246)*PI()/180)*$O$1)*ABS(F246)*$O$2","v":393.66457443382262}]
[null,"18HD05(65)","HAS","18HD06","18HD05(65)",1.4315276172629488E-3,157.79005001311049]
[null,235.60499999998137,296.06099999998696,782.77399999997579,235.60499999998137,null,null,438.14666666664806,{"$f":"H250+(COS(G249*PI()/180)*$O$1)*ABS(F249)*$O$2","v":382.92519327955546},{"$f":"(-1)*$Q$1*F249/$S$1","v":-11.929396810524574}]
[null,213.95299999997951,1618.6759999999776,131.10900000005495,213.95299999997951,null,null,654.57933333333733,{"$f":"H251+(SIN((G249)*PI()/180)*$O$1)*ABS(F249)*$O$2","v":677.12598682188127}]
[null,"18HD05(65)","HAS","18HD08(47)","18HD05(65)",2.0965197630865278E-3,164.19830071901029]
[null,235.60499999998137,296.06099999998696,556.50800000014715,235.60499999998137,null,null,362.72466666670516,{"$f":"H253+(COS(G252*PI()/180)*$O$1)*ABS(F252)*$O$2","v":278.67082879516693},{"$f":"(-1)*$Q$1*F252/$S$1","v":-17.470998025721066}]
[null,213.95299999997951,1618.6759999999776,489.57900000002701,213.95299999997951,null,null,774.06933333332802,{"$f":"H254+(SIN((G252)*PI()/180)*$O$1)*ABS(F252)*$O$2","v":797.85686450900687}]
[null,"18HD05(65)","HAS","18HD09(62)","18HD05(65)",3.664104849233977E-3,169.95091108529454]
[null,235.60499999998137,296.06099999998696,451.2160000000149,235.60499999998137,null,null,327.62733333332773,{"$f":"H256+(COS(G255*PI()/180)*$O$1)*ABS(F255)*$O$2","v":177.29848289473915},{"$f":"(-1)*$Q$1*F255/$S$1","v":-30.534207076949809}]
[null,213.95299999997951,1618.6759999999776,695.53300000005402,213.95299999997951,null,null,842.72066666667035,{"$f":"H257+(SIN((G255)*PI()/180)*$O$1)*ABS(F255)*$O$2","v":869.3605197305252}]
[null,"18HD05(65)","HAS","HAH","18HD05(65)",4.4840142617822163E-3,171.34383324695611]
[null,235.60499999998137,296.06099999998696,470.84499999997206,235.60499999998137,null,null,334.17033333331347,{"$f":"H259+(COS(G258*PI()/180)*$O$1)*ABS(F258)*$O$2","v":149.46457175147418},{"$f":"(-1)*$Q$1*F258/$S$1","v":-37.366785514851799}]
[null,213.95299999997951,1618.6759999999776,884.9089999999851,213.95299999997951,null,null,905.84599999998079,{"$f":"H260+(SIN((G258)*PI()/180)*$O$1)*ABS(F258)*$O$2","v":933.96535510098192}]
[null,"18HD05(65)","HAS","18HD03(57)","18HD05(65)",2.2509234627207438E-3,165.12832777287272]
[null,235.60499999998137,296.06099999998696,1446.7360000000335,235.60499999998137,null,null,659.46733333333395,{"$f":"H262+(COS(G261*PI()/180)*$O$1)*ABS(F261)*$O$2","v":568.82047982215272},{"$f":"(-1)*$Q$1*F261/$S$1","v":-18.757695522672865}]
[null,213.95299999997951,1618.6759999999776,1139.7540000000736,213.95299999997951,null,null,990.79433333334362,{"$f":"H263+(SIN((G261)*PI()/180)*$O$1)*ABS(F261)*$O$2","v":1014.8656125173627}]
[null,"18HD05(65)","HAS","MW125S","18HD05(65)",1.7785455888763659E-3,161.75671275940212]
[null,235.60499999998137,296.06099999998696,1270.5770000000484,235.60499999998137,null,null,600.74766666667222,{"$f":"H265+(COS(G264*PI()/180)*$O$1)*ABS(F264)*$O$2","v":530.36648186430762},{"$f":"(-1)*$Q$1*F264/$S$1","v":-14.821213240636384}]
[null,213.95299999997951,1618.6759999999776,498.1260000000475,213.95299999997951,null,null,776.91833333333489,{"$f":"H266+(SIN((G264)*PI()/180)*$O$1)*ABS(F264)*$O$2","v":800.11742542603929}]
[null,"18HD05(65)","HAS","MW133S","18HD05(65)",1.5403075027460103E-3,159.23609186979803]
[null,235.60499999998137,296.06099999998696,2559.1700000001583,235.60499999998137,null,null,1030.2786666667089,{"$f":"H268+(COS(G267*PI()/180)*$O$1)*ABS(F267)*$O$2","v":970.26769715454566},{"$f":"(-1)*$Q$1*F267/$S$1","v":-12.835895856216753}]
[null,213.95299999997951,1618.6759999999776,830.26100000005681,213.95299999997951,null,null,887.63000000000466,{"$f":"H269+(SIN((G267)*PI()/180)*$O$1)*ABS(F267)*$O$2","v":910.38278222551003}]
[null,"18HD05(65)","HAS","MW132S","18HD05(65)",1.9726557931969602E-3,163.34383900155535]
[null,235.60499999998137,296.06099999998696,1997.7360000000335,235.60499999998137,null,null,843.13400000000058,{"$f":"H271+(COS(G270*PI()/180)*$O$1)*ABS(F270)*$O$2","v":764.38869720115156},{"$f":"(-1)*$Q$1*F270/$S$1","v":-16.438798276641336}]
[null,213.95299999997951,1618.6759999999776,1434.6950000000652,213.95299999997951,null,null,1089.1080000000075,{"$f":"H272+(SIN((G270)*PI()/180)*$O$1)*ABS(F270)*$O$2","v":1112.6670642136012}]
[null,"18HD05(65)","18HD06","18HD08(47)","18HD05(65)",1.430097288228406E-3,184.75209635253287]
[null,235.60499999998137,782.77399999997579,556.50800000014715,235.60499999998137,null,null,524.96233333336806,{"$f":"H274+(COS(G273*PI()/180)*$O$1)*ABS(F273)*$O$2","v":465.57977963377374},{"$f":"(-1)*$Q$1*F273/$S$1","v":-11.917477401903383}]
[null,213.95299999997951,131.10900000005495,489.57900000002701,213.95299999997951,null,null,278.21366666668717,{"$f":"H275+(SIN((G273)*PI()/180)*$O$1)*ABS(F273)*$O$2","v":273.27716925083251}]
[null,"18HD05(65)","18HD06","18HD09(62)","18HD05(65)",1.491886980345872E-3,192.54115610883832]
[null,235.60499999998137,782.77399999997579,451.2160000000149,235.60499999998137,null,null,489.86499999999069,{"$f":"H277+(COS(G276*PI()/180)*$O$1)*ABS(F276)*$O$2","v":429.18620909993979},{"$f":"(-1)*$Q$1*F276/$S$1","v":-12.432391502882266}]
[null,213.95299999997951,131.10900000005495,695.53300000005402,213.95299999997951,null,null,346.86500000002951,{"$f":"H278+(SIN((G276)*PI()/180)*$O$1)*ABS(F276)*$O$2","v":333.36710027705846}]
[null,"18HD05(65)","18HD06","HAH","18HD05(65)",1.5079499559615141E-3,194.06640933496539]
[null,235.60499999998137,782.77399999997579,470.84499999997206,235.60499999998137,null,null,496.40799999997643,{"$f":"H280+(COS(G279*PI()/180)*$O$1)*ABS(F279)*$O$2","v":435.46076740643252},{"$f":"(-1)*$Q$1*F279/$S$1","v":-12.566249633012619}]
[null,213.95299999997951,131.10900000005495,884.9089999999851,213.95299999997951,null,null,409.99033333333983,{"$f":"H281+(SIN((G279)*PI()/180)*$O$1)*ABS(F279)*$O$2","v":394.7194268386944}]
[null,"18HD05(65)","18HD06","18HD03(57)","18HD05(65)",1.5041567012732239E-3,193.71804609368428]
[null,235.60499999998137,782.77399999997579,1446.7360000000335,235.60499999998137,null,null,821.70499999999686,{"$f":"H283+(COS(G282*PI()/180)*$O$1)*ABS(F282)*$O$2","v":760.81958984334142},{"$f":"(-1)*$Q$1*F282/$S$1","v":-12.534639177276865}]
[null,213.95299999997951,131.10900000005495,1139.7540000000736,213.95299999997951,null,null,494.93866666670266,{"$f":"H284+(SIN((G282)*PI()/180)*$O$1)*ABS(F282)*$O$2","v":480.07608571086121}]
[null,"18HD05(65)","18HD06","MW125S","18HD05(65)",1.4843397468324267E-3,191.77488537138439]
[null,235.60499999998137,782.77399999997579,1270.5770000000484,235.60499999998137,null,null,762.98533333333523,{"$f":"H286+(COS(G285*PI()/180)*$O$1)*ABS(F285)*$O$2","v":702.43930480314384},{"$f":"(-1)*$Q$1*F285/$S$1","v":-12.369497890270223}]
[null,213.95299999997951,131.10900000005495,498.1260000000475,213.95299999997951,null,null,281.06266666669399,{"$f":"H287+(SIN((G285)*PI()/180)*$O$1)*ABS(F285)*$O$2","v":268.44163736412764}]
[null,"18HD05(65)","18HD06","MW132S","18HD05(65)",1.4276248577151454E-3,184.32771880529845]
[null,235.60499999998137,782.77399999997579,1997.7360000000335,235.60499999998137,null,null,1005.3716666666636,{"$f":"H289+(COS(G288*PI()/180)*$O$1)*ABS(F288)*$O$2","v":946.05690280149975},{"$f":"(-1)*$Q$1*F288/$S$1","v":-11.89687381429288}]
[null,213.95299999997951,131.10900000005495,1434.6950000000652,213.95299999997951,null,null,593.25233333336655,{"$f":"H290+(SIN((G288)*PI()/180)*$O$1)*ABS(F288)*$O$2","v":588.76357499168262}]
[null,"18HD05(65)","18HD08(47)","18HD09(62)","18HD05(65)",1.2156197878837747E-3,202.99916696790643]
[null,235.60499999998137,556.50800000014715,451.2160000000149,235.60499999998137,null,null,414.44300000004779,{"$f":"H292+(COS(G291*PI()/180)*$O$1)*ABS(F291)*$O$2","v":367.81838248356786},{"$f":"(-1)*$Q$1*F291/$S$1","v":-10.130164899031458}]
[null,213.95299999997951,489.57900000002701,695.53300000005402,213.95299999997951,null,null,466.3550000000202,{"$f":"H293+(SIN((G291)*PI()/180)*$O$1)*ABS(F291)*$O$2","v":446.56482406646222}]
[null,"18HD05(65)","18HD08(47)","HAH","18HD05(65)",1.2089155446247406E-3,204.02613367171682]
[null,235.60499999998137,556.50800000014715,470.84499999997206,235.60499999998137,null,null,420.98600000003353,{"$f":"H295+(COS(G294*PI()/180)*$O$1)*ABS(F294)*$O$2","v":374.97871202537124},{"$f":"(-1)*$Q$1*F294/$S$1","v":-10.074296205206171}]
[null,213.95299999997951,489.57900000002701,884.9089999999851,213.95299999997951,null,null,529.48033333333058,{"$f":"H296+(SIN((G294)*PI()/180)*$O$1)*ABS(F294)*$O$2","v":508.97141932082661}]
[null,"18HD05(65)","18HD08(47)","MW125S","18HD05(65)",1.5407413136738195E-3,179.40608362388292]
[null,235.60499999998137,556.50800000014715,1270.5770000000484,235.60499999998137,null,null,687.56333333339228,{"$f":"H298+(COS(G297*PI()/180)*$O$1)*ABS(F297)*$O$2","v":623.36922757111927},{"$f":"(-1)*$Q$1*F297/$S$1","v":-12.839510947281831}]
[null,213.95299999997951,489.57900000002701,498.1260000000475,213.95299999997951,null,null,400.55266666668467,{"$f":"H299+(SIN((G297)*PI()/180)*$O$1)*ABS(F297)*$O$2","v":401.21811352133017}]
[null,"18HD05(65)","18HD09(62)","18HD03(57)","18HD05(65)",1.532257857271793E-3,191.4255944708629]
[null,235.60499999998137,451.2160000000149,1446.7360000000335,235.60499999998137,null,null,711.18566666667664,{"$f":"H301+(COS(G300*PI()/180)*$O$1)*ABS(F300)*$O$2","v":648.60680129613684},{"$f":"(-1)*$Q$1*F300/$S$1","v":-12.768815477264942}]
[null,213.95299999997951,695.53300000005402,1139.7540000000736,213.95299999997951,null,null,683.08000000003574,{"$f":"H302+(SIN((G300)*PI()/180)*$O$1)*ABS(F300)*$O$2","v":670.43279373750988}]
[null,"18HD05(65)","18HD09(62)","MW125S","18HD05(65)",1.4829185121877622E-3,192.79949938158094]
[null,235.60499999998137,451.2160000000149,1270.5770000000484,235.60499999998137,null,null,652.4660000000149,{"$f":"H304+(COS(G303*PI()/180)*$O$1)*ABS(F303)*$O$2","v":592.21308749265449},{"$f":"(-1)*$Q$1*F303/$S$1","v":-12.357654268231352}]
[null,213.95299999997951,695.53300000005402,498.1260000000475,213.95299999997951,null,null,469.20400000002701,{"$f":"H305+(SIN((G303)*PI()/180)*$O$1)*ABS(F303)*$O$2","v":455.51542776955756}]
[null,"18HD05(65)","18HD09(62)","MW133S","18HD05(65)",1.2591437195144763E-3,200.90720445260786]
[null,235.60499999998137,451.2160000000149,2559.1700000001583,235.60499999998137,null,null,1081.9970000000515,{"$f":"H307+(COS(G306*PI()/180)*$O$1)*ABS(F306)*$O$2","v":1032.9869497417415},{"$f":"(-1)*$Q$1*F306/$S$1","v":-10.492864329287304}]
[null,213.95299999997951,695.53300000005402,830.26100000005681,213.95299999997951,null,null,579.91566666669678,{"$f":"H308+(SIN((G306)*PI()/180)*$O$1)*ABS(F306)*$O$2","v":561.19348678563915}]
[null,"18HD05(65)","18HD09(62)","MW132S","18HD05(65)",1.2711704171595073E-3,200.36716880389028]
[null,235.60499999998137,451.2160000000149,1997.7360000000335,235.60499999998137,null,null,894.85233333334327,{"$f":"H310+(COS(G309*PI()/180)*$O$1)*ABS(F309)*$O$2","v":845.19821497407975},{"$f":"(-1)*$Q$1*F309/$S$1","v":-10.593086809662562}]
[null,213.95299999997951,695.53300000005402,1434.6950000000652,213.95299999997951,null,null,781.39366666669957,{"$f":"H311+(SIN((G309)*PI()/180)*$O$1)*ABS(F309)*$O$2","v":762.95984628430404}]
[null,"18HD05(65)","HAH","18HD03(57)","18HD05(65)",1.4971186798204039E-3,194.34003499919007]
[null,235.60499999998137,470.84499999997206,1446.7360000000335,235.60499999998137,null,null,717.72866666666232,{"$f":"H313+(COS(G312*PI()/180)*$O$1)*ABS(F312)*$O$2","v":657.29229947502336},{"$f":"(-1)*$Q$1*F312/$S$1","v":-12.475988998503366}]
[null,213.95299999997951,884.9089999999851,1139.7540000000736,213.95299999997951,null,null,746.20533333334606,{"$f":"H314+(SIN((G312)*PI()/180)*$O$1)*ABS(F312)*$O$2","v":730.75531527682551}]
[null,"18HD05(65)","HAH","MW125S","18HD05(65)",1.4815298364850976E-3,194.74245208256883]
[null,235.60499999998137,470.84499999997206,1270.5770000000484,235.60499999998137,null,null,659.00900000000058,{"$f":"H316+(COS(G315*PI()/180)*$O$1)*ABS(F315)*$O$2","v":599.31078790856554},{"$f":"(-1)*$Q$1*F315/$S$1","v":-12.346081970709147}]
[null,213.95299999997951,884.9089999999851,498.1260000000475,213.95299999997951,null,null,532.32933333333733,{"$f":"H317+(SIN((G315)*PI()/180)*$O$1)*ABS(F315)*$O$2","v":516.62051498908318}]
[null,"18HD05(65)","HAH","MW133S","18HD05(65)",1.2614203422217527E-3,201.81478924061147]
[null,235.60499999998137,470.84499999997206,2559.1700000001583,235.60499999998137,null,null,1088.5400000000373,{"$f":"H319+(COS(G318*PI()/180)*$O$1)*ABS(F318)*$O$2","v":1039.7445852717881},{"$f":"(-1)*$Q$1*F318/$S$1","v":-10.511836185181274}]
[null,213.95299999997951,884.9089999999851,830.26100000005681,213.95299999997951,null,null,643.0410000000071,{"$f":"H320+(SIN((G318)*PI()/180)*$O$1)*ABS(F318)*$O$2","v":623.50961497230549}]
[null,"18HD05(65)","HAH","MW132S","18HD05(65)",1.2639103911891941E-3,201.716268481827]
[null,235.60499999998137,470.84499999997206,1997.7360000000335,235.60499999998137,null,null,901.39533333332895,{"$f":"H322+(COS(G321*PI()/180)*$O$1)*ABS(F321)*$O$2","v":852.47001781156746},{"$f":"(-1)*$Q$1*F321/$S$1","v":-10.532586593243286}]
[null,213.95299999997951,884.9089999999851,1434.6950000000652,213.95299999997951,null,null,844.5190000000099,{"$f":"H323+(SIN((G321)*PI()/180)*$O$1)*ABS(F321)*$O$2","v":825.03315873769111}]
[null,"18HD05(65)","18HD03(57)","MW125S","18HD05(65)",1.4814914747866489E-3,195.80419478464216]
[null,235.60499999998137,1446.7360000000335,1270.5770000000484,235.60499999998137,null,null,984.30600000002107,{"$f":"H325+(COS(G324*PI()/180)*$O$1)*ABS(F324)*$O$2","v":924.91065759020626},{"$f":"(-1)*$Q$1*F324/$S$1","v":-12.345762289888741}]
[null,213.95299999997951,1139.7540000000736,498.1260000000475,213.95299999997951,null,null,617.27766666670016,{"$f":"H326+(SIN((G324)*PI()/180)*$O$1)*ABS(F324)*$O$2","v":600.46578209114386}]
[null,"18HD05(65)","18HD03(57)","MW133S","18HD05(65)",1.3785539581509794E-3,219.5851766898725]
[null,235.60499999998137,1446.7360000000335,2559.1700000001583,235.60499999998137,null,null,1413.8370000000577,{"$f":"H328+(COS(G327*PI()/180)*$O$1)*ABS(F327)*$O$2","v":1369.5694423125781},{"$f":"(-1)*$Q$1*F327/$S$1","v":-11.487949651258161}]
[null,213.95299999997951,1139.7540000000736,830.26100000005681,213.95299999997951,null,null,727.98933333336993,{"$f":"H329+(SIN((G327)*PI()/180)*$O$1)*ABS(F327)*$O$2","v":691.38731131092266}]
[null,"18HD05(65)","MW125S","MW132S","18HD05(65)",1.5639344244434202E-3,176.66147999200172]
[null,235.60499999998137,1270.5770000000484,1997.7360000000335,235.60499999998137,null,null,1167.9726666666877,{"$f":"H331+(COS(G330*PI()/180)*$O$1)*ABS(F330)*$O$2","v":1102.9193226373857},{"$f":"(-1)*$Q$1*F330/$S$1","v":-13.032786870361836}]
[null,213.95299999997951,498.1260000000475,1434.6950000000652,213.95299999997951,null,null,715.5913333333641,{"$f":"H332+(SIN((G330)*PI()/180)*$O$1)*ABS(F330)*$O$2","v":719.3861680876272}]
[null,"18HD05(65)","MW133S","MW132S","18HD05(65)",1.26212519795127E-3,202.07218361016226]
[null,235.60499999998137,2559.1700000001583,1997.7360000000335,235.60499999998137,null,null,1597.5036666667245,{"$f":"H334+(COS(G333*PI()/180)*$O$1)*ABS(F333)*$O$2","v":1548.7692698424526},{"$f":"(-1)*$Q$1*F333/$S$1","v":-10.517709982927251}]
[null,213.95299999997951,830.26100000005681,1434.6950000000652,213.95299999997951,null,null,826.30300000003388,{"$f":"H335+(SIN((G333)*PI()/180)*$O$1)*ABS(F333)*$O$2","v":806.54156917383625}]
[null,"MW108S","HR6","HR13","MW108S",1.8875721830966575E-3,199.05394153972355]
[null,0,964.22900000005029,801.62000000011176,0,null,null,588.61633333338739,{"$f":"H337+(COS(G336*PI()/180)*$O$1)*ABS(F336)*$O$2","v":514.27653275040348},{"$f":"(-1)*$Q$1*F336/$S$1","v":-15.729768192472147}]
[null,876.46400000003632,243.02399999997579,551.55300000007264,876.46400000003632,null,null,557.01366666669492,{"$f":"H338+(SIN((G336)*PI()/180)*$O$1)*ABS(F336)*$O$2","v":531.33810953535101}]
[null,"MW108S","HR6","HAS","MW108S",1.1981206739301812E-3,130.89341956036697]
[null,0,964.22900000005029,296.06099999998696,0,null,null,420.09666666667908,{"$f":"H340+(COS(G339*PI()/180)*$O$1)*ABS(F339)*$O$2","v":387.41522954501608},{"$f":"(-1)*$Q$1*F339/$S$1","v":-9.9843389494181771}]
[null,876.46400000003632,243.02399999997579,1618.6759999999776,876.46400000003632,null,null,912.72133333332988,{"$f":"H341+(SIN((G339)*PI()/180)*$O$1)*ABS(F339)*$O$2","v":950.45857321762071}]
[null,"MW108S","HR6","18HD06","MW108S",1.6060679476909551E-3,190.82465776644378]
[null,0,964.22900000005029,782.77399999997579,0,null,null,582.33433333334199,{"$f":"H343+(COS(G342*PI()/180)*$O$1)*ABS(F342)*$O$2","v":516.60556635985824},{"$f":"(-1)*$Q$1*F342/$S$1","v":-13.383899564091294}]
[null,876.46400000003632,243.02399999997579,131.10900000005495,876.46400000003632,null,null,416.86566666668904,{"$f":"H344+(SIN((G342)*PI()/180)*$O$1)*ABS(F342)*$O$2","v":404.29791505044739}]
[null,"MW108S","HR6","HAH","MW108S",1.8423956339789901E-3,197.9622132244964]
[null,0,964.22900000005029,470.84499999997206,0,null,null,478.35800000000745,{"$f":"H346+(COS(G345*PI()/180)*$O$1)*ABS(F345)*$O$2","v":405.33310548156578},{"$f":"(-1)*$Q$1*F345/$S$1","v":-15.353296949824918}]
[null,876.46400000003632,243.02399999997579,884.9089999999851,876.46400000003632,null,null,668.13233333333244,{"$f":"H347+(SIN((G345)*PI()/180)*$O$1)*ABS(F345)*$O$2","v":644.45833997969544}]
[null,"MW108S","HR6","18HD03(57)","MW108S",1.5912971933835702E-3,190.27363017580888]
[null,0,964.22900000005029,1446.7360000000335,0,null,null,803.65500000002794,{"$f":"H349+(COS(G348*PI()/180)*$O$1)*ABS(F348)*$O$2","v":738.41398813985518},{"$f":"(-1)*$Q$1*F348/$S$1","v":-13.260809944863086}]
[null,876.46400000003632,243.02399999997579,1139.7540000000736,876.46400000003632,null,null,753.08066666669527,{"$f":"H350+(SIN((G348)*PI()/180)*$O$1)*ABS(F348)*$O$2","v":741.25538099127562}]
[null,"MW108S","HR6","MW125S","MW108S",1.5004479272603829E-3,186.49390030647186]
[null,0,964.22900000005029,1270.5770000000484,0,null,null,744.9353333333662,{"$f":"H352+(COS(G351*PI()/180)*$O$1)*ABS(F351)*$O$2","v":682.81779559334404},{"$f":"(-1)*$Q$1*F351/$S$1","v":-12.503732727169858}]
[null,876.46400000003632,243.02399999997579,498.1260000000475,876.46400000003632,null,null,539.20466666668653,{"$f":"H353+(SIN((G351)*PI()/180)*$O$1)*ABS(F351)*$O$2","v":532.13396599918588}]
[null,"MW108S","HR6","MW133S","MW108S",1.2783713156610177E-3,172.30237332925151]
[null,0,964.22900000005029,2559.1700000001583,0,null,null,1174.4663333334029,{"$f":"H355+(COS(G354*PI()/180)*$O$1)*ABS(F354)*$O$2","v":1121.6808503862953},{"$f":"(-1)*$Q$1*F354/$S$1","v":-10.653094297175148}]
[null,876.46400000003632,243.02399999997579,830.26100000005681,876.46400000003632,null,null,649.91633333335631,{"$f":"H356+(SIN((G354)*PI()/180)*$O$1)*ABS(F354)*$O$2","v":657.05098417647764}]
[null,"MW108S","HR6","MW132S","MW108S",1.4245969832889778E-3,182.67651459294561]
[null,0,964.22900000005029,1997.7360000000335,0,null,null,987.32166666669457,{"$f":"H358+(COS(G357*PI()/180)*$O$1)*ABS(F357)*$O$2","v":928.02821290599491},{"$f":"(-1)*$Q$1*F357/$S$1","v":-11.871641527408148}]
[null,876.46400000003632,243.02399999997579,1434.6950000000652,876.46400000003632,null,null,851.3943333333591,{"$f":"H359+(SIN((G357)*PI()/180)*$O$1)*ABS(F357)*$O$2","v":848.62248286664624}]
[null,"MW108S","HR13","HAS","MW108S",1.5220900201782664E-3,137.04506591778156]
[null,0,801.62000000011176,296.06099999998696,0,null,null,365.89366666669957,{"$f":"H361+(COS(G360*PI()/180)*$O$1)*ABS(F360)*$O$2","v":319.47690362520325},{"$f":"(-1)*$Q$1*F360/$S$1","v":-12.684083501485553}]
[null,876.46400000003632,551.55300000007264,1618.6759999999776,876.46400000003632,null,null,1015.5643333333622,{"$f":"H362+(SIN((G360)*PI()/180)*$O$1)*ABS(F360)*$O$2","v":1058.780458397579}]
[null,"MW108S","HR13","18HD06","MW108S",1.7724413447753784E-3,194.58633443275744]
[null,0,801.62000000011176,782.77399999997579,0,null,null,528.13133333336248,{"$f":"H364+(COS(G363*PI()/180)*$O$1)*ABS(F363)*$O$2","v":456.65990602638948},{"$f":"(-1)*$Q$1*F363/$S$1","v":-14.77034453979482}]
[null,876.46400000003632,551.55300000007264,131.10900000005495,876.46400000003632,null,null,519.70866666672134,{"$f":"H365+(SIN((G363)*PI()/180)*$O$1)*ABS(F363)*$O$2","v":501.10995638051492}]
[null,"MW108S","HR13","18HD08(47)","MW108S",1.9991167007591556E-3,202.5934279834637]
[null,0,801.62000000011176,556.50800000014715,0,null,null,452.70933333341964,{"$f":"H367+(COS(G366*PI()/180)*$O$1)*ABS(F366)*$O$2","v":375.80545532637592},{"$f":"(-1)*$Q$1*F366/$S$1","v":-16.659305839659631}]
[null,876.46400000003632,551.55300000007264,489.57900000002701,876.46400000003632,null,null,639.19866666671203,{"$f":"H368+(SIN((G366)*PI()/180)*$O$1)*ABS(F366)*$O$2","v":607.19702102214126}]
[null,"MW108S","HR13","HAH","MW108S",1.8342794207005016E-3,197.10868518245249]
[null,0,801.62000000011176,470.84499999997206,0,null,null,424.15500000002794,{"$f":"H370+(COS(G369*PI()/180)*$O$1)*ABS(F369)*$O$2","v":351.10876334815794},{"$f":"(-1)*$Q$1*F369/$S$1","v":-15.285661839170848}]
[null,876.46400000003632,551.55300000007264,884.9089999999851,876.46400000003632,null,null,770.97533333336469,{"$f":"H371+(SIN((G369)*PI()/180)*$O$1)*ABS(F369)*$O$2","v":748.49125546621394}]
[null,"MW108S","HR13","18HD03(57)","MW108S",1.5979697506435036E-3,185.07633898586971]
[null,0,801.62000000011176,1446.7360000000335,0,null,null,749.45200000004843,{"$f":"H373+(COS(G372*PI()/180)*$O$1)*ABS(F372)*$O$2","v":683.13108255391887},{"$f":"(-1)*$Q$1*F372/$S$1","v":-13.316414588695864}]
[null,876.46400000003632,551.55300000007264,1139.7540000000736,876.46400000003632,null,null,855.92366666672751,{"$f":"H374+(SIN((G372)*PI()/180)*$O$1)*ABS(F372)*$O$2","v":850.03228766394102}]
[null,"MW108S","HR13","MW132S","MW108S",1.4856746539780696E-3,174.7683855714688]
[null,0,801.62000000011176,1997.7360000000335,0,null,null,933.11866666671506,{"$f":"H376+(COS(G375*PI()/180)*$O$1)*ABS(F375)*$O$2","v":871.47342970100249},{"$f":"(-1)*$Q$1*F375/$S$1","v":-12.380622116483913}]
[null,876.46400000003632,551.55300000007264,1434.6950000000652,876.46400000003632,null,null,954.23733333339135,{"$f":"H377+(SIN((G375)*PI()/180)*$O$1)*ABS(F375)*$O$2","v":959.88178717946096}]
[null,"MW108S","HAS","18HD06","MW108S",9.596461466131412E-4,123.23871082460829]
[null,0,296.06099999998696,782.77399999997579,0,null,null,359.61166666665423,{"$f":"H379+(COS(G378*PI()/180)*$O$1)*ABS(F378)*$O$2","v":337.69461050579741},{"$f":"(-1)*$Q$1*F378/$S$1","v":-7.9970512217761769}]
[null,876.46400000003632,1618.6759999999776,131.10900000005495,876.46400000003632,null,null,875.41633333335631,{"$f":"H380+(SIN((G378)*PI()/180)*$O$1)*ABS(F378)*$O$2","v":908.85976849385747}]
[null,"MW108S","HAS","18HD08(47)","MW108S",1.1222814247298827E-3,128.87099856905925]
[null,0,296.06099999998696,556.50800000014715,0,null,null,284.18966666671139,{"$f":"H382+(COS(G381*PI()/180)*$O$1)*ABS(F381)*$O$2","v":254.84345452034313},{"$f":"(-1)*$Q$1*F381/$S$1","v":-9.3523452060823562}]
[null,876.46400000003632,1618.6759999999776,489.57900000002701,876.46400000003632,null,null,994.90633333334699,{"$f":"H383+(SIN((G381)*PI()/180)*$O$1)*ABS(F381)*$O$2","v":1031.3131850786385}]
[null,"MW108S","HAS","18HD09(62)","MW108S",1.5599089136695899E-3,137.58312166326314]
[null,0,296.06099999998696,451.2160000000149,0,null,null,249.09233333333395,{"$f":"H385+(COS(G384*PI()/180)*$O$1)*ABS(F384)*$O$2","v":201.10845160545276},{"$f":"(-1)*$Q$1*F384/$S$1","v":-12.999240947246582}]
[null,876.46400000003632,1618.6759999999776,695.53300000005402,876.46400000003632,null,null,1063.5576666666893,{"$f":"H386+(SIN((G384)*PI()/180)*$O$1)*ABS(F384)*$O$2","v":1107.3988998204113}]
[null,"MW108S","HAS","HAH","MW108S",2.2123226663085158E-3,143.84139793847197]
[null,0,296.06099999998696,470.84499999997206,0,null,null,255.63533333331966,{"$f":"H388+(COS(G387*PI()/180)*$O$1)*ABS(F387)*$O$2","v":181.21032546401719},{"$f":"(-1)*$Q$1*F387/$S$1","v":-18.436022219237632}]
[null,876.46400000003632,1618.6759999999776,884.9089999999851,876.46400000003632,null,null,1126.6829999999998,{"$f":"H389+(SIN((G387)*PI()/180)*$O$1)*ABS(F387)*$O$2","v":1181.0713359311519}]
[null,"MW108S","HAS","18HD03(57)","MW108S",2.2897512053806305E-3,144.33874156022944]
[null,0,296.06099999998696,1446.7360000000335,0,null,null,580.93233333334013,{"$f":"H391+(COS(G390*PI()/180)*$O$1)*ABS(F390)*$O$2","v":503.41682164150353},{"$f":"(-1)*$Q$1*F390/$S$1","v":-19.08126004483859}]
[null,876.46400000003632,1618.6759999999776,1139.7540000000736,876.46400000003632,null,null,1211.6313333333626,{"$f":"H392+(SIN((G390)*PI()/180)*$O$1)*ABS(F390)*$O$2","v":1267.2524405645352}]
[null,"MW108S","HAS","MW125S","MW108S",1.5377539505194574E-3,137.27136574943725]
[null,0,296.06099999998696,1270.5770000000484,0,null,null,522.2126666666785,{"$f":"H394+(COS(G393*PI()/180)*$O$1)*ABS(F393)*$O$2","v":475.1461455096163},{"$f":"(-1)*$Q$1*F393/$S$1","v":-12.814616254328813}]
[null,876.46400000003632,1618.6759999999776,498.1260000000475,876.46400000003632,null,null,997.75533333335386,{"$f":"H395+(SIN((G393)*PI()/180)*$O$1)*ABS(F393)*$O$2","v":1041.2306404606707}]
[null,"MW108S","HAS","MW133S","MW108S",1.6596771677876794E-3,138.87714362350565]
[null,0,296.06099999998696,2559.1700000001583,0,null,null,951.74366666671506,{"$f":"H397+(COS(G396*PI()/180)*$O$1)*ABS(F396)*$O$2","v":899.65047398821287},{"$f":"(-1)*$Q$1*F396/$S$1","v":-13.83064306489733}]
[null,876.46400000003632,1618.6759999999776,830.26100000005681,876.46400000003632,null,null,1108.4670000000235,{"$f":"H398+(SIN((G396)*PI()/180)*$O$1)*ABS(F396)*$O$2","v":1153.9473965052791}]
[null,"MW108S","HAS","MW132S","MW108S",2.236012780275195E-3,143.99734026107279]
[null,0,296.06099999998696,1997.7360000000335,0,null,null,764.59900000000687,{"$f":"H400+(COS(G399*PI()/180)*$O$1)*ABS(F399)*$O$2","v":689.22769475982079},{"$f":"(-1)*$Q$1*F399/$S$1","v":-18.633439835626625}]
[null,876.46400000003632,1618.6759999999776,1434.6950000000652,876.46400000003632,null,null,1309.9450000000263,{"$f":"H401+(SIN((G399)*PI()/180)*$O$1)*ABS(F399)*$O$2","v":1364.710804559885}]
[null,"MW108S","18HD06","18HD09(62)","MW108S",1.8522771040795413E-3,196.10615753454536]
[null,0,782.77399999997579,451.2160000000149,0,null,null,411.32999999999691,{"$f":"H403+(COS(G402*PI()/180)*$O$1)*ABS(F402)*$O$2","v":337.18108266644509},{"$f":"(-1)*$Q$1*F402/$S$1","v":-15.435642533996177}]
[null,876.46400000003632,131.10900000005495,695.53300000005402,876.46400000003632,null,null,567.70200000004843,{"$f":"H404+(SIN((G402)*PI()/180)*$O$1)*ABS(F402)*$O$2","v":546.29138185869397}]
[null,"MW108S","18HD06","HAH","MW108S",1.8204174928214208E-3,195.51850839377045]
[null,0,782.77399999997579,470.84499999997206,0,null,null,417.8729999999826,{"$f":"H406+(COS(G405*PI()/180)*$O$1)*ABS(F405)*$O$2","v":344.78747951843502},{"$f":"(-1)*$Q$1*F405/$S$1","v":-15.170145773511841}]
[null,876.46400000003632,131.10900000005495,884.9089999999851,876.46400000003632,null,null,630.82733333335875,{"$f":"H407+(SIN((G405)*PI()/180)*$O$1)*ABS(F405)*$O$2","v":610.53349767616305}]
[null,"MW108S","18HD06","18HD03(57)","MW108S",1.5913008302371472E-3,190.44339620758103]
[null,0,782.77399999997579,1446.7360000000335,0,null,null,743.17000000000314,{"$f":"H409+(COS(G408*PI()/180)*$O$1)*ABS(F408)*$O$2","v":677.96416348607761},{"$f":"(-1)*$Q$1*F408/$S$1","v":-13.260840251976227}]
[null,876.46400000003632,131.10900000005495,1139.7540000000736,876.46400000003632,null,null,715.77566666672158,{"$f":"H410+(SIN((G408)*PI()/180)*$O$1)*ABS(F408)*$O$2","v":703.7570981483816}]
[null,"MW108S","18HD06","MW125S","MW108S",1.5258600218941364E-3,188.63984543530125]
[null,0,782.77399999997579,1270.5770000000484,0,null,null,684.4503333333414,{"$f":"H412+(COS(G411*PI()/180)*$O$1)*ABS(F411)*$O$2","v":621.59430036530148},{"$f":"(-1)*$Q$1*F411/$S$1","v":-12.715500182451137}]
[null,876.46400000003632,131.10900000005495,498.1260000000475,876.46400000003632,null,null,501.8996666667129,{"$f":"H413+(SIN((G411)*PI()/180)*$O$1)*ABS(F411)*$O$2","v":492.34886870169731}]
[null,"MW108S","18HD06","MW133S","MW108S",1.2697365924826561E-3,179.01741870787635]
[null,0,782.77399999997579,2559.1700000001583,0,null,null,1113.981333333378,{"$f":"H415+(COS(G414*PI()/180)*$O$1)*ABS(F414)*$O$2","v":1061.0834215119412},{"$f":"(-1)*$Q$1*F414/$S$1","v":-10.581138270688802}]
[null,876.46400000003632,131.10900000005495,830.26100000005681,876.46400000003632,null,null,612.61133333338273,{"$f":"H416+(SIN((G414)*PI()/180)*$O$1)*ABS(F414)*$O$2","v":613.51858330851178}]
[null,"MW108S","18HD06","MW132S","MW108S",1.4126488908318721E-3,184.99042033720542]
[null,0,782.77399999997579,1997.7360000000335,0,null,null,926.83666666666977,{"$f":"H418+(COS(G417*PI()/180)*$O$1)*ABS(F417)*$O$2","v":868.19942079284863},{"$f":"(-1)*$Q$1*F417/$S$1","v":-11.772074090265601}]
[null,876.46400000003632,131.10900000005495,1434.6950000000652,876.46400000003632,null,null,814.08933333338553,{"$f":"H419+(SIN((G417)*PI()/180)*$O$1)*ABS(F417)*$O$2","v":808.96911790817057}]
[null,"MW108S","18HD08(47)","18HD09(62)","MW108S",2.1254831652577038E-3,204.74651397670198]
[null,0,556.50800000014715,451.2160000000149,0,null,null,335.90800000005402,{"$f":"H421+(COS(G420*PI()/180)*$O$1)*ABS(F420)*$O$2","v":255.47895145560139},{"$f":"(-1)*$Q$1*F420/$S$1","v":-17.712359710480868}]
[null,876.46400000003632,489.57900000002701,695.53300000005402,876.46400000003632,null,null,687.19200000003912,{"$f":"H422+(SIN((G420)*PI()/180)*$O$1)*ABS(F420)*$O$2","v":650.11963410479677}]
[null,"MW108S","18HD08(47)","HAH","MW108S",1.8621423803595657E-3,199.85530144185438]
[null,0,556.50800000014715,470.84499999997206,0,null,null,342.45100000003976,{"$f":"H424+(COS(G423*PI()/180)*$O$1)*ABS(F423)*$O$2","v":269.47415348063487},{"$f":"(-1)*$Q$1*F423/$S$1","v":-15.517853169663049}]
[null,876.46400000003632,489.57900000002701,884.9089999999851,876.46400000003632,null,null,750.31733333334944,{"$f":"H425+(SIN((G423)*PI()/180)*$O$1)*ABS(F423)*$O$2","v":723.96445783628531}]
[null,"MW108S","18HD08(47)","18HD03(57)","MW108S",1.5926076981662221E-3,192.6391893861128]
[null,0,556.50800000014715,1446.7360000000335,0,null,null,667.74800000006019,{"$f":"H427+(COS(G426*PI()/180)*$O$1)*ABS(F426)*$O$2","v":602.99739346052559},{"$f":"(-1)*$Q$1*F426/$S$1","v":-13.271730818051852}]
[null,876.46400000003632,489.57900000002701,1139.7540000000736,876.46400000003632,null,null,835.26566666671226,{"$f":"H428+(SIN((G426)*PI()/180)*$O$1)*ABS(F426)*$O$2","v":820.74568300855844}]
[null,"MW108S","18HD08(47)","MW125S","MW108S",1.570264677574513E-3,191.8861766263831]
[null,0,556.50800000014715,1270.5770000000484,0,null,null,609.02833333339856,{"$f":"H430+(COS(G429*PI()/180)*$O$1)*ABS(F429)*$O$2","v":545.00349286722781},{"$f":"(-1)*$Q$1*F429/$S$1","v":-13.085538979787609}]
[null,876.46400000003632,489.57900000002701,498.1260000000475,876.46400000003632,null,null,621.38966666670365,{"$f":"H431+(SIN((G429)*PI()/180)*$O$1)*ABS(F429)*$O$2","v":607.91364859496207}]
[null,"MW108S","18HD08(47)","MW133S","MW108S",1.2703296072221874E-3,177.21416672602371]
[null,0,556.50800000014715,2559.1700000001583,0,null,null,1038.5593333334352,{"$f":"H433+(COS(G432*PI()/180)*$O$1)*ABS(F432)*$O$2","v":985.69148696246043},{"$f":"(-1)*$Q$1*F432/$S$1","v":-10.586080060184896}]
[null,876.46400000003632,489.57900000002701,830.26100000005681,876.46400000003632,null,null,732.10133333337342,{"$f":"H434+(SIN((G432)*PI()/180)*$O$1)*ABS(F432)*$O$2","v":734.6738993891064}]
[null,"MW108S","18HD08(47)","MW132S","MW108S",1.4107028259541657E-3,185.42049519360367]
[null,0,556.50800000014715,1997.7360000000335,0,null,null,851.41466666672693,{"$f":"H436+(COS(G435*PI()/180)*$O$1)*ABS(F435)*$O$2","v":792.89822924849307},{"$f":"(-1)*$Q$1*F435/$S$1","v":-11.755856882951381}]
[null,876.46400000003632,489.57900000002701,1434.6950000000652,876.46400000003632,null,null,933.57933333337621,{"$f":"H437+(SIN((G435)*PI()/180)*$O$1)*ABS(F435)*$O$2","v":928.0267818307957}]
[null,"MW108S","18HD09(62)","HAH","MW108S",1.8119132123018578E-3,194.43855267136553]
[null,0,451.2160000000149,470.84499999997206,0,null,null,307.35366666666232,{"$f":"H439+(COS(G438*PI()/180)*$O$1)*ABS(F438)*$O$2","v":234.24179038014569},{"$f":"(-1)*$Q$1*F438/$S$1","v":-15.099276769182149}]
[null,876.46400000003632,695.53300000005402,884.9089999999851,876.46400000003632,null,null,818.96866666669177,{"$f":"H440+(SIN((G438)*PI()/180)*$O$1)*ABS(F438)*$O$2","v":800.14428036396782}]
[null,"MW108S","18HD09(62)","18HD03(57)","MW108S",1.6054946643799411E-3,182.68887008718698]
[null,0,451.2160000000149,1446.7360000000335,0,null,null,632.65066666668281,{"$f":"H442+(COS(G441*PI()/180)*$O$1)*ABS(F441)*$O$2","v":565.82870726941724},{"$f":"(-1)*$Q$1*F441/$S$1","v":-13.379122203166176}]
[null,876.46400000003632,695.53300000005402,1139.7540000000736,876.46400000003632,null,null,903.9170000000546,{"$f":"H443+(SIN((G441)*PI()/180)*$O$1)*ABS(F441)*$O$2","v":900.77876554553336}]
[null,"MW108S","18HD09(62)","MW132S","MW108S",1.5083055961978592E-3,172.61610784558798]
[null,0,451.2160000000149,1997.7360000000335,0,null,null,816.31733333334944,{"$f":"H445+(COS(G444*PI()/180)*$O$1)*ABS(F444)*$O$2","v":753.992428381232},{"$f":"(-1)*$Q$1*F444/$S$1","v":-12.569213301648828}]
[null,876.46400000003632,695.53300000005402,1434.6950000000652,876.46400000003632,null,null,1002.2306666667185,{"$f":"H446+(SIN((G444)*PI()/180)*$O$1)*ABS(F444)*$O$2","v":1010.3074419061422}]
[null,"MW108S","18HD03(57)","MW125S","MW108S",1.5936029152779549E-3,193.3970892906645]
[null,0,1446.7360000000335,1270.5770000000484,0,null,null,905.77100000002736,{"$f":"H448+(COS(G447*PI()/180)*$O$1)*ABS(F447)*$O$2","v":841.17778186986288},{"$f":"(-1)*$Q$1*F447/$S$1","v":-13.280024293982958}]
[null,876.46400000003632,1139.7540000000736,498.1260000000475,876.46400000003632,null,null,838.11466666671913,{"$f":"H449+(SIN((G447)*PI()/180)*$O$1)*ABS(F447)*$O$2","v":822.7298591343374}]
[null,"MW108S","MW125S","MW133S","MW108S",1.3985123100030228E-3,154.18505582752073]
[null,0,1270.5770000000484,2559.1700000001583,0,null,null,1276.5823333334022,{"$f":"H451+(COS(G450*PI()/180)*$O$1)*ABS(F450)*$O$2","v":1224.1261631681068},{"$f":"(-1)*$Q$1*F450/$S$1","v":-11.654269250025189}]
[null,876.46400000003632,498.1260000000475,830.26100000005681,876.46400000003632,null,null,734.95033333338017,{"$f":"H452+(SIN((G450)*PI()/180)*$O$1)*ABS(F450)*$O$2","v":760.32551816801049}]
[null,"MW108S","MW125S","MW132S","MW108S",1.4409844019683375E-3,180.09240587656723]
[null,0,1270.5770000000484,1997.7360000000335,0,null,null,1089.437666666694,{"$f":"H454+(COS(G453*PI()/180)*$O$1)*ABS(F453)*$O$2","v":1029.3967280037775},{"$f":"(-1)*$Q$1*F453/$S$1","v":-12.008203349736146}]
[null,876.46400000003632,498.1260000000475,1434.6950000000652,876.46400000003632,null,null,936.42833333338297,{"$f":"H455+(SIN((G453)*PI()/180)*$O$1)*ABS(F453)*$O$2","v":936.33150001643355}]
[null,"MW108S","MW133S","MW132S","MW108S",1.4044255290174377E-3,204.26384211139353]
[null,0,2559.1700000001583,1997.7360000000335,0,null,null,1518.9686666667305,{"$f":"H457+(COS(G456*PI()/180)*$O$1)*ABS(F456)*$O$2","v":1465.6202292559312},{"$f":"(-1)*$Q$1*F456/$S$1","v":-11.703546075145315}]
[null,876.46400000003632,830.26100000005681,1434.6950000000652,876.46400000003632,null,null,1047.1400000000529,{"$f":"H458+(SIN((G456)*PI()/180)*$O$1)*ABS(F456)*$O$2","v":1023.0927757495856}]
[null,"HR6","HR13","18HD06","HR6",1.5505861177092393E-3,197.13491291366569]
[null,964.22900000005029,801.62000000011176,782.77399999997579,964.22900000005029,null,null,849.54100000004598,{"$f":"H460+(COS(G459*PI()/180)*$O$1)*ABS(F459)*$O$2","v":787.80094653039305},{"$f":"(-1)*$Q$1*F459/$S$1","v":-12.921550980910329}]
[null,243.02399999997579,551.55300000007264,131.10900000005495,243.02399999997579,null,null,308.56200000003446,{"$f":"H461+(SIN((G459)*PI()/180)*$O$1)*ABS(F459)*$O$2","v":289.52709019276176}]
[null,"HR6","HR13","18HD08(47)","HR6",1.9861456546138917E-3,199.49072250293017]
[null,964.22900000005029,801.62000000011176,556.50800000014715,964.22900000005029,null,null,774.11900000010303,{"$f":"H463+(COS(G462*PI()/180)*$O$1)*ABS(F462)*$O$2","v":696.10522375277606},{"$f":"(-1)*$Q$1*F462/$S$1","v":-16.5512137884491}]
[null,243.02399999997579,551.55300000007264,489.57900000002701,243.02399999997579,null,null,428.05200000002515,{"$f":"H464+(SIN((G462)*PI()/180)*$O$1)*ABS(F462)*$O$2","v":400.4400883964131}]
[null,"HR6","HR13","18HD09(62)","HR6",1.8206402386463764E-3,198.73007567358891]
[null,964.22900000005029,801.62000000011176,451.2160000000149,964.22900000005029,null,null,739.02166666672565,{"$f":"H466+(COS(G465*PI()/180)*$O$1)*ABS(F465)*$O$2","v":667.17906241492892},{"$f":"(-1)*$Q$1*F465/$S$1","v":-15.172001988719805}]
[null,243.02399999997579,551.55300000007264,695.53300000005402,243.02399999997579,null,null,496.70333333336748,{"$f":"H467+(SIN((G465)*PI()/180)*$O$1)*ABS(F465)*$O$2","v":472.34391373924205}]
[null,"HR6","HR13","18HD03(57)","HR6",1.417494627268449E-3,196.12092301367721]
[null,964.22900000005029,801.62000000011176,1446.7360000000335,964.22900000005029,null,null,1070.8616666667319,{"$f":"H469+(COS(G468*PI()/180)*$O$1)*ABS(F468)*$O$2","v":1014.1218478902346},{"$f":"(-1)*$Q$1*F468/$S$1","v":-11.812455227237075}]
[null,243.02399999997579,551.55300000007264,1139.7540000000736,243.02399999997579,null,null,644.77700000004063,{"$f":"H470+(SIN((G468)*PI()/180)*$O$1)*ABS(F468)*$O$2","v":628.37744428663018}]
[null,"HR6","HR13","MW125S","HR6",1.3733831931612868E-3,195.74054962338192]
[null,964.22900000005029,801.62000000011176,1270.5770000000484,964.22900000005029,null,null,1012.1420000000702,{"$f":"H472+(COS(G471*PI()/180)*$O$1)*ABS(F471)*$O$2","v":957.06361182188448},{"$f":"(-1)*$Q$1*F471/$S$1","v":-11.444859943010725}]
[null,243.02399999997579,551.55300000007264,498.1260000000475,243.02399999997579,null,null,430.90100000003196,{"$f":"H473+(SIN((G471)*PI()/180)*$O$1)*ABS(F471)*$O$2","v":415.37709477063225}]
[null,"HR6","HR13","MW133S","HR6",1.1381842521485657E-3,193.20010001907309]
[null,964.22900000005029,801.62000000011176,2559.1700000001583,964.22900000005029,null,null,1441.6730000001069,{"$f":"H475+(COS(G474*PI()/180)*$O$1)*ABS(F474)*$O$2","v":1395.5016782598707},{"$f":"(-1)*$Q$1*F474/$S$1","v":-9.4848687679047146}]
[null,243.02399999997579,551.55300000007264,830.26100000005681,243.02399999997579,null,null,541.61266666670178,{"$f":"H476+(SIN((G474)*PI()/180)*$O$1)*ABS(F474)*$O$2","v":530.7831958869748}]
[null,"HR6","HR13","MW132S","HR6",1.2008628417065875E-3,193.97723648108527]
[null,964.22900000005029,801.62000000011176,1997.7360000000335,964.22900000005029,null,null,1254.5283333333985,{"$f":"H478+(COS(G477*PI()/180)*$O$1)*ABS(F477)*$O$2","v":1205.9738578198373},{"$f":"(-1)*$Q$1*F477/$S$1","v":-10.007190347554896}]
[null,243.02399999997579,551.55300000007264,1434.6950000000652,243.02399999997579,null,null,743.09066666670458,{"$f":"H479+(SIN((G477)*PI()/180)*$O$1)*ABS(F477)*$O$2","v":731.00516403305755}]
[null,"HR6","HAS","18HD08(47)","HR6",1.2727384901004266E-3,140.49055539979196]
[null,964.22900000005029,296.06099999998696,556.50800000014715,964.22900000005029,null,null,605.59933333339484,{"$f":"H481+(COS(G480*PI()/180)*$O$1)*ABS(F480)*$O$2","v":564.68504807174907},{"$f":"(-1)*$Q$1*F480/$S$1","v":-10.606154084170221}]
[null,243.02399999997579,1618.6759999999776,489.57900000002701,243.02399999997579,null,null,783.75966666666011,{"$f":"H482+(SIN((G480)*PI()/180)*$O$1)*ABS(F480)*$O$2","v":817.49812947926762}]
[null,"HR6","HAS","18HD09(62)","HR6",1.2308526325537962E-3,96.007587627407588]
[null,964.22900000005029,296.06099999998696,451.2160000000149,964.22900000005029,null,null,570.50200000001735,{"$f":"H484+(COS(G483*PI()/180)*$O$1)*ABS(F483)*$O$2","v":565.13444829964544},{"$f":"(-1)*$Q$1*F483/$S$1","v":-10.257105271281635}]
[null,243.02399999997579,1618.6759999999776,695.53300000005402,243.02399999997579,null,null,852.41100000000245,{"$f":"H485+(SIN((G483)*PI()/180)*$O$1)*ABS(F483)*$O$2","v":903.4148685042411}]
[null,"HR6","HAS","18HD03(57)","HR6",2.3611869580682692E-3,176.55504476737337]
[null,964.22900000005029,296.06099999998696,1446.7360000000335,964.22900000005029,null,null,902.34200000002363,{"$f":"H487+(COS(G486*PI()/180)*$O$1)*ABS(F486)*$O$2","v":804.13698897429458},{"$f":"(-1)*$Q$1*F486/$S$1","v":-19.676557983902246}]
[null,243.02399999997579,1618.6759999999776,1139.7540000000736,243.02399999997579,null,null,1000.4846666666757,{"$f":"H488+(SIN((G486)*PI()/180)*$O$1)*ABS(F486)*$O$2","v":1006.3964482748805}]
[null,"HR6","HAS","MW125S","HR6",1.9568424151707488E-3,169.64666611514681]
[null,964.22900000005029,296.06099999998696,1270.5770000000484,964.22900000005029,null,null,843.62233333336189,{"$f":"H490+(COS(G489*PI()/180)*$O$1)*ABS(F489)*$O$2","v":763.41477307838909},{"$f":"(-1)*$Q$1*F489/$S$1","v":-16.307020126422909}]
[null,243.02399999997579,1618.6759999999776,498.1260000000475,243.02399999997579,null,null,786.60866666666698,{"$f":"H491+(SIN((G489)*PI()/180)*$O$1)*ABS(F489)*$O$2","v":801.26199096642745}]
[null,"HR6","HAS","MW133S","HR6",1.542615593019515E-3,157.29325655286993]
[null,964.22900000005029,296.06099999998696,2559.1700000001583,964.22900000005029,null,null,1273.1533333333985,{"$f":"H493+(COS(G492*PI()/180)*$O$1)*ABS(F492)*$O$2","v":1213.8595180210043},{"$f":"(-1)*$Q$1*F492/$S$1","v":-12.855129941829293}]
[null,243.02399999997579,1618.6759999999776,830.26100000005681,243.02399999997579,null,null,897.32033333333675,{"$f":"H494+(SIN((G492)*PI()/180)*$O$1)*ABS(F492)*$O$2","v":922.13167370891085}]
[null,"HR6","HAS","MW132S","HR6",1.9455207032919616E-3,169.40171727045615]
[null,964.22900000005029,296.06099999998696,1997.7360000000335,964.22900000005029,null,null,1086.0086666666903,{"$f":"H496+(COS(G495*PI()/180)*$O$1)*ABS(F495)*$O$2","v":1006.3281751112055},{"$f":"(-1)*$Q$1*F495/$S$1","v":-16.212672527433014}]
[null,243.02399999997579,1618.6759999999776,1434.6950000000652,243.02399999997579,null,null,1098.7983333333395,{"$f":"H497+(SIN((G495)*PI()/180)*$O$1)*ABS(F495)*$O$2","v":1113.7076601967779}]
[null,"HR6","18HD06","18HD08(47)","HR6",1.6336947418791772E-3,188.41206854709955]
[null,964.22900000005029,782.77399999997579,556.50800000014715,964.22900000005029,null,null,767.83700000005774,{"$f":"H499+(COS(G498*PI()/180)*$O$1)*ABS(F498)*$O$2","v":700.49872068866875},{"$f":"(-1)*$Q$1*F498/$S$1","v":-13.614122848993144}]
[null,243.02399999997579,131.10900000005495,489.57900000002701,243.02399999997579,null,null,287.90400000001927,{"$f":"H500+(SIN((G498)*PI()/180)*$O$1)*ABS(F498)*$O$2","v":277.94585443629671}]
[null,"HR6","18HD06","18HD09(62)","HR6",1.5791740798093363E-3,193.56057133273924]
[null,964.22900000005029,782.77399999997579,451.2160000000149,964.22900000005029,null,null,732.73966666668036,{"$f":"H502+(COS(G501*PI()/180)*$O$1)*ABS(F501)*$O$2","v":668.77505041890322},{"$f":"(-1)*$Q$1*F501/$S$1","v":-13.159783998411136}]
[null,243.02399999997579,131.10900000005495,695.53300000005402,243.02399999997579,null,null,356.5553333333616,{"$f":"H503+(SIN((G501)*PI()/180)*$O$1)*ABS(F501)*$O$2","v":341.12725048436363}]
[null,"HR6","18HD06","HAH","HR6",1.571727818195731E-3,194.41015063731339]
[null,964.22900000005029,782.77399999997579,470.84499999997206,964.22900000005029,null,null,739.28266666666605,{"$f":"H505+(COS(G504*PI()/180)*$O$1)*ABS(F504)*$O$2","v":675.85434054726159},{"$f":"(-1)*$Q$1*F504/$S$1","v":-13.097731818297758}]
[null,243.02399999997579,131.10900000005495,884.9089999999851,243.02399999997579,null,null,419.68066666667193,{"$f":"H506+(SIN((G504)*PI()/180)*$O$1)*ABS(F504)*$O$2","v":403.38306207913462}]
[null,"HR6","18HD08(47)","HAH","HR6",1.981965432023051E-3,199.39157556417715]
[null,964.22900000005029,556.50800000014715,470.84499999997206,964.22900000005029,null,null,663.8606666667232,{"$f":"H508+(COS(G507*PI()/180)*$O$1)*ABS(F507)*$O$2","v":585.96352167468979},{"$f":"(-1)*$Q$1*F507/$S$1","v":-16.516378600192091}]
[null,243.02399999997579,489.57900000002701,884.9089999999851,243.02399999997579,null,null,539.17066666666267,{"$f":"H509+(SIN((G507)*PI()/180)*$O$1)*ABS(F507)*$O$2","v":511.751624857872}]
[null,"HR6","18HD08(47)","18HD03(57)","HR6",1.6436970172555815E-3,188.8320539456349]
[null,964.22900000005029,556.50800000014715,1446.7360000000335,964.22900000005029,null,null,989.15766666674369,{"$f":"H511+(COS(G510*PI()/180)*$O$1)*ABS(F510)*$O$2","v":921.48237046146221},{"$f":"(-1)*$Q$1*F510/$S$1","v":-13.697475143796511}]
[null,243.02399999997579,489.57900000002701,1139.7540000000736,243.02399999997579,null,null,624.11900000002549,{"$f":"H512+(SIN((G510)*PI()/180)*$O$1)*ABS(F510)*$O$2","v":613.60353917320026}]
[null,"HR6","18HD08(47)","MW125S","HR6",1.5431772361489721E-3,184.1502248945967]
[null,964.22900000005029,556.50800000014715,1270.5770000000484,964.22900000005029,null,null,930.43800000008196,{"$f":"H514+(COS(G513*PI()/180)*$O$1)*ABS(F513)*$O$2","v":866.30755823845425},{"$f":"(-1)*$Q$1*F513/$S$1","v":-12.859810301241435}]
[null,243.02399999997579,489.57900000002701,498.1260000000475,243.02399999997579,null,null,410.24300000001676,{"$f":"H515+(SIN((G513)*PI()/180)*$O$1)*ABS(F513)*$O$2","v":405.58956427398016}]
[null,"HR6","18HD08(47)","MW133S","HR6",1.3338567596122841E-3,168.09122118250144]
[null,964.22900000005029,556.50800000014715,2559.1700000001583,964.22900000005029,null,null,1359.9690000001185,{"$f":"H517+(COS(G516*PI()/180)*$O$1)*ABS(F516)*$O$2","v":1305.5878055700302},{"$f":"(-1)*$Q$1*F516/$S$1","v":-11.115472996769034}]
[null,243.02399999997579,489.57900000002701,830.26100000005681,243.02399999997579,null,null,520.95466666668653,{"$f":"H518+(SIN((G516)*PI()/180)*$O$1)*ABS(F516)*$O$2","v":532.4232843211588}]
[null,"HR6","18HD08(47)","MW132S","HR6",1.4813666834914124E-3,180.61950092268521]
[null,964.22900000005029,556.50800000014715,1997.7360000000335,964.22900000005029,null,null,1172.8243333334103,{"$f":"H520+(COS(G519*PI()/180)*$O$1)*ABS(F519)*$O$2","v":1111.1043294317619},{"$f":"(-1)*$Q$1*F519/$S$1","v":-12.344722362428437}]
[null,243.02399999997579,489.57900000002701,1434.6950000000652,243.02399999997579,null,null,722.43266666668933,{"$f":"H521+(SIN((G519)*PI()/180)*$O$1)*ABS(F519)*$O$2","v":721.7653035597292}]
[null,"HR6","18HD09(62)","HAH","HR6",1.6850766236634327E-3,196.04726190138169]
[null,964.22900000005029,451.2160000000149,470.84499999997206,964.22900000005029,null,null,628.76333333334571,{"$f":"H523+(COS(G522*PI()/180)*$O$1)*ABS(F522)*$O$2","v":561.2876695038259},{"$f":"(-1)*$Q$1*F522/$S$1","v":-14.042305197195274}]
[null,243.02399999997579,695.53300000005402,884.9089999999851,243.02399999997579,null,null,607.822000000005,{"$f":"H524+(SIN((G522)*PI()/180)*$O$1)*ABS(F522)*$O$2","v":588.413414991173}]
[null,"HR6","18HD09(62)","18HD03(57)","HR6",1.5277830087279582E-3,192.19832444880882]
[null,964.22900000005029,451.2160000000149,1446.7360000000335,964.22900000005029,null,null,954.0603333333662,{"$f":"H526+(COS(G525*PI()/180)*$O$1)*ABS(F525)*$O$2","v":891.83996513556087},{"$f":"(-1)*$Q$1*F525/$S$1","v":-12.731525072732985}]
[null,243.02399999997579,695.53300000005402,1139.7540000000736,243.02399999997579,null,null,692.77033333336783,{"$f":"H527+(SIN((G525)*PI()/180)*$O$1)*ABS(F525)*$O$2","v":679.31971817010287}]
[null,"HR6","18HD09(62)","MW125S","HR6",1.4476633222273217E-3,189.82464043377311]
[null,964.22900000005029,451.2160000000149,1270.5770000000484,964.22900000005029,null,null,895.34066666670458,{"$f":"H529+(COS(G528*PI()/180)*$O$1)*ABS(F528)*$O$2","v":835.90596785084244},{"$f":"(-1)*$Q$1*F528/$S$1","v":-12.063861018561013}]
[null,243.02399999997579,695.53300000005402,498.1260000000475,243.02399999997579,null,null,478.8943333333591,{"$f":"H530+(SIN((G528)*PI()/180)*$O$1)*ABS(F528)*$O$2","v":468.60185338212011}]
[null,"HR6","18HD09(62)","MW133S","HR6",1.2052081623883982E-3,179.81976000054732]
[null,964.22900000005029,451.2160000000149,2559.1700000001583,964.22900000005029,null,null,1324.8716666667412,{"$f":"H532+(COS(G531*PI()/180)*$O$1)*ABS(F531)*$O$2","v":1274.654908372617},{"$f":"(-1)*$Q$1*F531/$S$1","v":-10.043401353236652}]
[null,243.02399999997579,695.53300000005402,830.26100000005681,243.02399999997579,null,null,589.60600000002887,{"$f":"H533+(SIN((G531)*PI()/180)*$O$1)*ABS(F531)*$O$2","v":589.76397146705085}]
[null,"HR6","18HD09(62)","MW132S","HR6",1.3424081899774299E-3,186.11888568920943]
[null,964.22900000005029,451.2160000000149,1997.7360000000335,964.22900000005029,null,null,1137.7270000000328,{"$f":"H535+(COS(G534*PI()/180)*$O$1)*ABS(F534)*$O$2","v":1082.1119871897188},{"$f":"(-1)*$Q$1*F534/$S$1","v":-11.186734916478583}]
[null,243.02399999997579,695.53300000005402,1434.6950000000652,243.02399999997579,null,null,791.08400000003166,{"$f":"H536+(SIN((G534)*PI()/180)*$O$1)*ABS(F534)*$O$2","v":785.12192801139895}]
[null,"HR6","HAH","18HD03(57)","HR6",1.4975738386497875E-3,193.19222413471542]
[null,964.22900000005029,470.84499999997206,1446.7360000000335,964.22900000005029,null,null,960.603333333352,{"$f":"H538+(COS(G537*PI()/180)*$O$1)*ABS(F537)*$O$2","v":899.85113783507711},{"$f":"(-1)*$Q$1*F537/$S$1","v":-12.479781988748229}]
[null,243.02399999997579,884.9089999999851,1139.7540000000736,243.02399999997579,null,null,755.89566666667815,{"$f":"H539+(SIN((G537)*PI()/180)*$O$1)*ABS(F537)*$O$2","v":741.65506610678233}]
[null,"HR6","HAH","MW125S","HR6",1.4205732763661835E-3,191.77831058724959]
[null,964.22900000005029,470.84499999997206,1270.5770000000484,964.22900000005029,null,null,901.88366666669026,{"$f":"H541+(COS(G540*PI()/180)*$O$1)*ABS(F540)*$O$2","v":843.93938650756729},{"$f":"(-1)*$Q$1*F540/$S$1","v":-11.838110636384863}]
[null,243.02399999997579,884.9089999999851,498.1260000000475,243.02399999997579,null,null,542.01966666666942,{"$f":"H542+(SIN((G540)*PI()/180)*$O$1)*ABS(F540)*$O$2","v":529.93736627215537}]
[null,"HR6","HAH","MW133S","HR6",1.1673945114441284E-3,185.60734360442439]
[null,964.22900000005029,470.84499999997206,2559.1700000001583,964.22900000005029,null,null,1331.4146666667268,{"$f":"H544+(COS(G543*PI()/180)*$O$1)*ABS(F543)*$O$2","v":1283.0059835838492},{"$f":"(-1)*$Q$1*F543/$S$1","v":-9.7282875953677355}]
[null,243.02399999997579,884.9089999999851,830.26100000005681,243.02399999997579,null,null,652.73133333333919,{"$f":"H545+(SIN((G543)*PI()/180)*$O$1)*ABS(F543)*$O$2","v":647.97855618348513}]
[null,"HR6","HAH","MW132S","HR6",1.2865938773621455E-3,188.86082386749462]
[null,964.22900000005029,470.84499999997206,1997.7360000000335,964.22900000005029,null,null,1144.2700000000186,{"$f":"H547+(COS(G546*PI()/180)*$O$1)*ABS(F546)*$O$2","v":1091.3017117589443},{"$f":"(-1)*$Q$1*F546/$S$1","v":-10.721615644684546}]
[null,243.02399999997579,884.9089999999851,1434.6950000000652,243.02399999997579,null,null,854.20933333334199,{"$f":"H548+(SIN((G546)*PI()/180)*$O$1)*ABS(F546)*$O$2","v":845.95182210906444}]
[null,"HR6","18HD03(57)","MW125S","HR6",1.3357179131923047E-3,199.6662284213441]
[null,964.22900000005029,1446.7360000000335,1270.5770000000484,964.22900000005029,null,null,1227.1806666667107,{"$f":"H550+(COS(G549*PI()/180)*$O$1)*ABS(F549)*$O$2","v":1174.7721562477709},{"$f":"(-1)*$Q$1*F549/$S$1","v":-11.130982609935874}]
[null,243.02399999997579,1139.7540000000736,498.1260000000475,243.02399999997579,null,null,626.96800000003225,{"$f":"H551+(SIN((G549)*PI()/180)*$O$1)*ABS(F549)*$O$2","v":608.23788034651045}]
[null,"HR6","18HD03(57)","MW133S","HR6",1.1509016412748017E-3,211.23583367578897]
[null,964.22900000005029,1446.7360000000335,2559.1700000001583,964.22900000005029,null,null,1656.7116666667473,{"$f":"H553+(COS(G552*PI()/180)*$O$1)*ABS(F552)*$O$2","v":1615.7088722179226},{"$f":"(-1)*$Q$1*F552/$S$1","v":-9.5908470106233477}]
[null,243.02399999997579,1139.7540000000736,830.26100000005681,243.02399999997579,null,null,737.67966666670202,{"$f":"H554+(SIN((G552)*PI()/180)*$O$1)*ABS(F552)*$O$2","v":712.81242904534565}]
[null,"HR6","18HD03(57)","MW132S","HR6",9.9416460668754468E-4,237.80412953472279]
[null,964.22900000005029,1446.7360000000335,1997.7360000000335,964.22900000005029,null,null,1469.5670000000391,{"$f":"H556+(COS(G555*PI()/180)*$O$1)*ABS(F555)*$O$2","v":1447.4959125241319},{"$f":"(-1)*$Q$1*F555/$S$1","v":-8.284705055729539}]
[null,243.02399999997579,1139.7540000000736,1434.6950000000652,243.02399999997579,null,null,939.15766666670481,{"$f":"H557+(SIN((G555)*PI()/180)*$O$1)*ABS(F555)*$O$2","v":904.10377181689375}]
[null,"HR6","MW133S","MW132S","HR6",1.1297571655901326E-3,199.49718197041739]
[null,964.22900000005029,2559.1700000001583,1997.7360000000335,964.22900000005029,null,null,1840.378333333414,{"$f":"H559+(COS(G558*PI()/180)*$O$1)*ABS(F558)*$O$2","v":1796.0043947450727},{"$f":"(-1)*$Q$1*F558/$S$1","v":-9.4146430465844393}]
[null,243.02399999997579,830.26100000005681,1434.6950000000652,243.02399999997579,null,null,835.99333333336597,{"$f":"H560+(SIN((G558)*PI()/180)*$O$1)*ABS(F558)*$O$2","v":820.28215366654501}]
[null,"HR13","HAS","18HD08(47)","HR13",2.2397464748250655E-3,166.19312400052758]
[null,801.62000000011176,296.06099999998696,556.50800000014715,801.62000000011176,null,null,551.39633333341533,{"$f":"H562+(COS(G561*PI()/180)*$O$1)*ABS(F561)*$O$2","v":460.77006462122728},{"$f":"(-1)*$Q$1*F561/$S$1","v":-18.664553956875547}]
[null,551.55300000007264,1618.6759999999776,489.57900000002701,551.55300000007264,null,null,886.60266666669247,{"$f":"H563+(SIN((G561)*PI()/180)*$O$1)*ABS(F561)*$O$2","v":908.87414572701198}]
[null,"HR13","HAS","18HD09(62)","HR13",1.495276088787351E-3,134.2957723718655]
[null,801.62000000011176,296.06099999998696,451.2160000000149,801.62000000011176,null,null,516.29900000003784,{"$f":"H565+(COS(G564*PI()/180)*$O$1)*ABS(F564)*$O$2","v":472.78880371762591},{"$f":"(-1)*$Q$1*F564/$S$1","v":-12.460634073227926}]
[null,551.55300000007264,1618.6759999999776,695.53300000005402,551.55300000007264,null,null,955.25400000003481,{"$f":"H566+(SIN((G564)*PI()/180)*$O$1)*ABS(F564)*$O$2","v":999.84713688384477}]
[null,"HR13","HAS","HAH","HR13",2.0248298163906327E-3,69.653487289758729]
[null,801.62000000011176,296.06099999998696,470.84499999997206,801.62000000011176,null,null,522.84200000002363,{"$f":"H568+(COS(G567*PI()/180)*$O$1)*ABS(F567)*$O$2","v":552.17646171949036},{"$f":"(-1)*$Q$1*F567/$S$1","v":-16.873581803255274}]
[null,551.55300000007264,1618.6759999999776,884.9089999999851,551.55300000007264,null,null,1018.3793333333451,{"$f":"H569+(SIN((G567)*PI()/180)*$O$1)*ABS(F567)*$O$2","v":1097.4832739899764}]
[null,"HR13","HAS","18HD03(57)","HR13",2.2595466815362466E-3,166.60079740600514]
[null,801.62000000011176,296.06099999998696,1446.7360000000335,801.62000000011176,null,null,848.13900000004412,{"$f":"H571+(COS(G570*PI()/180)*$O$1)*ABS(F570)*$O$2","v":756.55400854034974},{"$f":"(-1)*$Q$1*F570/$S$1","v":-18.829555679468722}]
[null,551.55300000007264,1618.6759999999776,1139.7540000000736,551.55300000007264,null,null,1103.327666666708,{"$f":"H572+(SIN((G570)*PI()/180)*$O$1)*ABS(F570)*$O$2","v":1125.1449423097167}]
[null,"HR13","HAS","MW125S","HR13",1.5433841782414722E-3,138.95255412399578]
[null,801.62000000011176,296.06099999998696,1270.5770000000484,801.62000000011176,null,null,789.41933333338238,{"$f":"H574+(COS(G573*PI()/180)*$O$1)*ABS(F573)*$O$2","v":740.92066892357343},{"$f":"(-1)*$Q$1*F573/$S$1","v":-12.861534818678935}]
[null,551.55300000007264,1618.6759999999776,498.1260000000475,551.55300000007264,null,null,889.45166666669923,{"$f":"H575+(SIN((G573)*PI()/180)*$O$1)*ABS(F573)*$O$2","v":931.6814724650568}]
[null,"HR13","HAS","MW133S","HR13",1.6094906565096827E-3,143.86304380594336]
[null,801.62000000011176,296.06099999998696,2559.1700000001583,801.62000000011176,null,null,1218.9503333334189,{"$f":"H577+(COS(G576*PI()/180)*$O$1)*ABS(F576)*$O$2","v":1164.7903235861741},{"$f":"(-1)*$Q$1*F576/$S$1","v":-13.412422137580691}]
[null,551.55300000007264,1618.6759999999776,830.26100000005681,551.55300000007264,null,null,1000.163333333369,{"$f":"H578+(SIN((G576)*PI()/180)*$O$1)*ABS(F576)*$O$2","v":1039.7110264910609}]
[null,"HR13","HAS","MW132S","HR13",1.9957138613853707E-3,160.22424422836133]
[null,801.62000000011176,296.06099999998696,1997.7360000000335,801.62000000011176,null,null,1031.8056666667107,{"$f":"H580+(COS(G579*PI()/180)*$O$1)*ABS(F579)*$O$2","v":953.55505507214957},{"$f":"(-1)*$Q$1*F579/$S$1","v":-16.630948844878091}]
[null,551.55300000007264,1618.6759999999776,1434.6950000000652,551.55300000007264,null,null,1201.6413333333719,{"$f":"H581+(SIN((G579)*PI()/180)*$O$1)*ABS(F579)*$O$2","v":1229.7758898804534}]
[null,"HR13","18HD06","18HD08(47)","HR13",1.9782693168302781E-3,192.75509599011806]
[null,801.62000000011176,782.77399999997579,556.50800000014715,801.62000000011176,null,null,713.63400000007823,{"$f":"H583+(COS(G582*PI()/180)*$O$1)*ABS(F582)*$O$2","v":633.24021056108313},{"$f":"(-1)*$Q$1*F582/$S$1","v":-16.48557764025232}]
[null,551.55300000007264,131.10900000005495,489.57900000002701,551.55300000007264,null,null,390.74700000005151,{"$f":"H584+(SIN((G582)*PI()/180)*$O$1)*ABS(F582)*$O$2","v":372.54822605898073}]
[null,"HR13","18HD06","18HD09(62)","HR13",1.7275091925609634E-3,195.04687681235282]
[null,801.62000000011176,782.77399999997579,451.2160000000149,801.62000000011176,null,null,678.53666666670085,{"$f":"H586+(COS(G585*PI()/180)*$O$1)*ABS(F585)*$O$2","v":609.02502588381071},{"$f":"(-1)*$Q$1*F585/$S$1","v":-14.395909938008028}]
[null,551.55300000007264,131.10900000005495,695.53300000005402,551.55300000007264,null,null,459.39833333339385,{"$f":"H587+(SIN((G585)*PI()/180)*$O$1)*ABS(F585)*$O$2","v":440.71177749098661}]
[null,"HR13","18HD06","HAH","HR13",1.7211009887458271E-3,195.11461677150353]
[null,801.62000000011176,782.77399999997579,470.84499999997206,801.62000000011176,null,null,685.07966666668653,{"$f":"H589+(COS(G588*PI()/180)*$O$1)*ABS(F588)*$O$2","v":615.84793893939525},{"$f":"(-1)*$Q$1*F588/$S$1","v":-14.342508239548559}]
[null,551.55300000007264,131.10900000005495,884.9089999999851,551.55300000007264,null,null,522.52366666670423,{"$f":"H590+(SIN((G588)*PI()/180)*$O$1)*ABS(F588)*$O$2","v":503.82456398951228}]
[null,"HR13","18HD06","18HD03(57)","HR13",1.3774291455545219E-3,199.73607560705227]
[null,801.62000000011176,782.77399999997579,1446.7360000000335,801.62000000011176,null,null,1010.376666666707,{"$f":"H592+(COS(G591*PI()/180)*$O$1)*ABS(F591)*$O$2","v":956.35515189788725},{"$f":"(-1)*$Q$1*F591/$S$1","v":-11.47857621295435}]
[null,551.55300000007264,131.10900000005495,1139.7540000000736,551.55300000007264,null,null,607.47200000006706,{"$f":"H593+(SIN((G591)*PI()/180)*$O$1)*ABS(F591)*$O$2","v":588.09111408127524}]
[null,"HR13","18HD06","MW125S","HR13",1.4105833563530313E-3,199.18477264135242]
[null,801.62000000011176,782.77399999997579,1270.5770000000484,801.62000000011176,null,null,951.65700000004529,{"$f":"H595+(COS(G594*PI()/180)*$O$1)*ABS(F594)*$O$2","v":896.14679871403257},{"$f":"(-1)*$Q$1*F594/$S$1","v":-11.754861302941928}]
[null,551.55300000007264,131.10900000005495,498.1260000000475,551.55300000007264,null,null,393.59600000005838,{"$f":"H596+(SIN((G594)*PI()/180)*$O$1)*ABS(F594)*$O$2","v":374.28184302981015}]
[null,"HR13","18HD06","MW133S","HR13",1.1743840247776824E-3,203.86394371505992]
[null,801.62000000011176,782.77399999997579,2559.1700000001583,801.62000000011176,null,null,1381.188000000082,{"$f":"H598+(COS(G597*PI()/180)*$O$1)*ABS(F597)*$O$2","v":1336.4386481999188},{"$f":"(-1)*$Q$1*F597/$S$1","v":-9.7865335398140196}]
[null,551.55300000007264,131.10900000005495,830.26100000005681,551.55300000007264,null,null,504.30766666672815,{"$f":"H599+(SIN((G597)*PI()/180)*$O$1)*ABS(F597)*$O$2","v":484.51116491483128}]
[null,"HR13","18HD06","MW132S","HR13",1.1325647741761413E-3,204.92044562496127]
[null,801.62000000011176,782.77399999997579,1997.7360000000335,801.62000000011176,null,null,1194.0433333333738,{"$f":"H601+(COS(G600*PI()/180)*$O$1)*ABS(F600)*$O$2","v":1151.246838629904},{"$f":"(-1)*$Q$1*F600/$S$1","v":-9.4380397848011786}]
[null,551.55300000007264,131.10900000005495,1434.6950000000652,551.55300000007264,null,null,705.78566666673089,{"$f":"H602+(SIN((G600)*PI()/180)*$O$1)*ABS(F600)*$O$2","v":685.90162996431218}]
[null,"HR13","18HD08(47)","18HD09(62)","HR13",2.0108385271605839E-3,204.61351106409006]
[null,801.62000000011176,556.50800000014715,451.2160000000149,801.62000000011176,null,null,603.1146666667579,{"$f":"H604+(COS(G603*PI()/180)*$O$1)*ABS(F603)*$O$2","v":526.94260187110581},{"$f":"(-1)*$Q$1*F603/$S$1","v":-16.756987726338203}]
[null,551.55300000007264,489.57900000002701,695.53300000005402,551.55300000007264,null,null,578.88833333338459,{"$f":"H605+(SIN((G603)*PI()/180)*$O$1)*ABS(F603)*$O$2","v":543.99230940109112}]
[null,"HR13","18HD08(47)","HAH","HR13",1.9857860856276372E-3,199.37771736811129]
[null,801.62000000011176,556.50800000014715,470.84499999997206,801.62000000011176,null,null,609.65766666674369,{"$f":"H607+(COS(G606*PI()/180)*$O$1)*ABS(F606)*$O$2","v":531.60371623130823},{"$f":"(-1)*$Q$1*F606/$S$1","v":-16.548217380230309}]
[null,551.55300000007264,489.57900000002701,884.9089999999851,551.55300000007264,null,null,642.01366666669492,{"$f":"H608+(SIN((G606)*PI()/180)*$O$1)*ABS(F606)*$O$2","v":614.56064710587987}]
[null,"HR13","18HD09(62)","HAH","HR13",1.7352600454965707E-3,195.38052716695523]
[null,801.62000000011176,451.2160000000149,470.84499999997206,801.62000000011176,null,null,574.5603333333662,{"$f":"H610+(COS(G609*PI()/180)*$O$1)*ABS(F609)*$O$2","v":504.84730203175803},{"$f":"(-1)*$Q$1*F609/$S$1","v":-14.460500379138089}]
[null,551.55300000007264,695.53300000005402,884.9089999999851,551.55300000007264,null,null,710.66500000003725,{"$f":"H611+(SIN((G609)*PI()/180)*$O$1)*ABS(F609)*$O$2","v":691.48832022700765}]
[null,"HR13","18HD09(62)","18HD03(57)","HR13",1.5677489904830837E-3,186.55226119423503]
[null,801.62000000011176,451.2160000000149,1446.7360000000335,801.62000000011176,null,null,899.85733333338669,{"$f":"H613+(COS(G612*PI()/180)*$O$1)*ABS(F612)*$O$2","v":834.96113557474916},{"$f":"(-1)*$Q$1*F612/$S$1","v":-13.064574920692365}]
[null,551.55300000007264,695.53300000005402,1139.7540000000736,551.55300000007264,null,null,795.61333333340008,{"$f":"H614+(SIN((G612)*PI()/180)*$O$1)*ABS(F612)*$O$2","v":788.15937714011511}]
[null,"HR13","18HD09(62)","MW132S","HR13",1.4494824425038716E-3,176.40206993128282]
[null,801.62000000011176,451.2160000000149,1997.7360000000335,801.62000000011176,null,null,1083.5240000000533,{"$f":"H616+(COS(G615*PI()/180)*$O$1)*ABS(F615)*$O$2","v":1023.2479372031017},{"$f":"(-1)*$Q$1*F615/$S$1","v":-12.079020354198931}]
[null,551.55300000007264,695.53300000005402,1434.6950000000652,551.55300000007264,null,null,893.92700000006391,{"$f":"H617+(SIN((G615)*PI()/180)*$O$1)*ABS(F615)*$O$2","v":897.717062219441}]
[null,"HR13","HAH","18HD03(57)","HR13",1.5015582687830621E-3,190.21853720078076]
[null,801.62000000011176,470.84499999997206,1446.7360000000335,801.62000000011176,null,null,906.40033333337249,{"$f":"H619+(COS(G618*PI()/180)*$O$1)*ABS(F618)*$O$2","v":844.82779387892538},{"$f":"(-1)*$Q$1*F618/$S$1","v":-12.512985573192184}]
[null,551.55300000007264,884.9089999999851,1139.7540000000736,551.55300000007264,null,null,858.7386666667104,{"$f":"H620+(SIN((G618)*PI()/180)*$O$1)*ABS(F618)*$O$2","v":847.63945119878429}]
[null,"HR13","HAH","MW125S","HR13",1.2907645339835273E-3,183.48592062354541]
[null,801.62000000011176,470.84499999997206,1270.5770000000484,801.62000000011176,null,null,847.68066666671075,{"$f":"H622+(COS(G621*PI()/180)*$O$1)*ABS(F621)*$O$2","v":793.99831989565894},{"$f":"(-1)*$Q$1*F621/$S$1","v":-10.756371116529396}]
[null,551.55300000007264,884.9089999999851,498.1260000000475,551.55300000007264,null,null,644.86266666670178,{"$f":"H623+(SIN((G621)*PI()/180)*$O$1)*ABS(F621)*$O$2","v":641.59255427333699}]
[null,"HR13","HAH","MW133S","HR13",1.1586191335621881E-3,177.45725527908297]
[null,801.62000000011176,470.84499999997206,2559.1700000001583,801.62000000011176,null,null,1277.2116666667473,{"$f":"H625+(COS(G624*PI()/180)*$O$1)*ABS(F624)*$O$2","v":1228.9834016919456},{"$f":"(-1)*$Q$1*F624/$S$1","v":-9.6551594463515666}]
[null,551.55300000007264,884.9089999999851,830.26100000005681,551.55300000007264,null,null,755.57433333337156,{"$f":"H626+(SIN((G624)*PI()/180)*$O$1)*ABS(F624)*$O$2","v":757.71607465344312}]
[null,"HR13","HAH","MW132S","HR13",1.3111316872800845E-3,184.26299428093856]
[null,801.62000000011176,470.84499999997206,1997.7360000000335,801.62000000011176,null,null,1090.0670000000391,{"$f":"H628+(COS(G627*PI()/180)*$O$1)*ABS(F627)*$O$2","v":1035.587656348426},{"$f":"(-1)*$Q$1*F627/$S$1","v":-10.926097394000704}]
[null,551.55300000007264,884.9089999999851,1434.6950000000652,551.55300000007264,null,null,957.05233333337435,{"$f":"H629+(SIN((G627)*PI()/180)*$O$1)*ABS(F627)*$O$2","v":952.99139478801783}]
[null,"HR13","18HD03(57)","MW125S","HR13",1.3963384401273519E-3,197.94124294876502]
[null,801.62000000011176,1446.7360000000335,1270.5770000000484,801.62000000011176,null,null,1172.9776666667312,{"$f":"H631+(COS(G630*PI()/180)*$O$1)*ABS(F630)*$O$2","v":1117.6260595355461},{"$f":"(-1)*$Q$1*F630/$S$1","v":-11.636153667727934}]
[null,551.55300000007264,1139.7540000000736,498.1260000000475,551.55300000007264,null,null,729.81100000006461,{"$f":"H632+(SIN((G630)*PI()/180)*$O$1)*ABS(F630)*$O$2","v":711.88890769839986}]
[null,"HR13","18HD03(57)","MW133S","HR13",1.2783766851064378E-3,216.393192154921]
[null,801.62000000011176,1446.7360000000335,2559.1700000001583,801.62000000011176,null,null,1602.5086666667678,{"$f":"H634+(COS(G633*PI()/180)*$O$1)*ABS(F633)*$O$2","v":1559.6316835366918},{"$f":"(-1)*$Q$1*F633/$S$1","v":-10.653139042553649}]
[null,551.55300000007264,1139.7540000000736,830.26100000005681,551.55300000007264,null,null,840.52266666673438,{"$f":"H635+(SIN((G633)*PI()/180)*$O$1)*ABS(F633)*$O$2","v":808.91889150991665}]
[null,"HR13","MW125S","MW132S","HR13",1.2981233290547973E-3,185.18744262349875]
[null,801.62000000011176,1270.5770000000484,1997.7360000000335,801.62000000011176,null,null,1356.644333333398,{"$f":"H637+(COS(G636*PI()/180)*$O$1)*ABS(F636)*$O$2","v":1302.7773947751996},{"$f":"(-1)*$Q$1*F636/$S$1","v":-10.817694408789977}]
[null,551.55300000007264,498.1260000000475,1434.6950000000652,551.55300000007264,null,null,828.12466666672844,{"$f":"H638+(SIN((G636)*PI()/180)*$O$1)*ABS(F636)*$O$2","v":823.23429465465938}]
[null,"HR13","MW133S","MW132S","HR13",1.1566290434196246E-3,200.07172496430289]
[null,801.62000000011176,2559.1700000001583,1997.7360000000335,801.62000000011176,null,null,1786.1753333334345,{"$f":"H640+(COS(G639*PI()/180)*$O$1)*ABS(F639)*$O$2","v":1740.9095120440265},{"$f":"(-1)*$Q$1*F639/$S$1","v":-9.6385753618302044}]
[null,551.55300000007264,830.26100000005681,1434.6950000000652,551.55300000007264,null,null,938.83633333339822,{"$f":"H641+(SIN((G639)*PI()/180)*$O$1)*ABS(F639)*$O$2","v":922.29672033498161}]
[null,"HAS","18HD06","18HD03(57)","HAS",2.3369438987704875E-3,174.76266150159509]
[null,296.06099999998696,782.77399999997579,1446.7360000000335,296.06099999998696,null,null,841.85699999999872,{"$f":"H643+(COS(G642*PI()/180)*$O$1)*ABS(F642)*$O$2","v":744.89085636854543},{"$f":"(-1)*$Q$1*F642/$S$1","v":-19.474532489754065}]
[null,1618.6759999999776,131.10900000005495,1139.7540000000736,1618.6759999999776,null,null,963.17966666670202,{"$f":"H644+(SIN((G642)*PI()/180)*$O$1)*ABS(F642)*$O$2","v":972.06799505884283}]
[null,"HAS","18HD06","MW125S","HAS",1.9672002208559265E-3,170.02257102178004]
[null,296.06099999998696,782.77399999997579,1270.5770000000484,296.06099999998696,null,null,783.1373333333371,{"$f":"H646+(COS(G645*PI()/180)*$O$1)*ABS(F645)*$O$2","v":702.41031464044431},{"$f":"(-1)*$Q$1*F645/$S$1","v":-16.39333517379939}]
[null,1618.6759999999776,131.10900000005495,498.1260000000475,1618.6759999999776,null,null,749.3036666666934,{"$f":"H647+(SIN((G645)*PI()/180)*$O$1)*ABS(F645)*$O$2","v":763.5052301711296}]
[null,"HAS","18HD06","MW133S","HAS",1.5397653892068963E-3,161.12837416649353]
[null,296.06099999998696,782.77399999997579,2559.1700000001583,296.06099999998696,null,null,1212.6683333333738,{"$f":"H649+(COS(G648*PI()/180)*$O$1)*ABS(F648)*$O$2","v":1151.9601538423276},{"$f":"(-1)*$Q$1*F648/$S$1","v":-12.831378243390803}]
[null,1618.6759999999776,131.10900000005495,830.26100000005681,1618.6759999999776,null,null,860.01533333336317,{"$f":"H650+(SIN((G648)*PI()/180)*$O$1)*ABS(F648)*$O$2","v":880.76680637763161}]
[null,"HAS","18HD06","MW132S","HAS",1.9448362378693658E-3,169.67027153585303]
[null,296.06099999998696,782.77399999997579,1997.7360000000335,296.06099999998696,null,null,1025.5236666666653,{"$f":"H652+(COS(G651*PI()/180)*$O$1)*ABS(F651)*$O$2","v":945.80222544400169},{"$f":"(-1)*$Q$1*F651/$S$1","v":-16.206968648911385}]
[null,1618.6759999999776,131.10900000005495,1434.6950000000652,1618.6759999999776,null,null,1061.4933333333659,{"$f":"H653+(SIN((G651)*PI()/180)*$O$1)*ABS(F651)*$O$2","v":1076.0239089947527}]
[null,"HAS","18HD08(47)","18HD03(57)","HAS",2.2584850530507879E-3,166.43296195218048]
[null,296.06099999998696,556.50800000014715,1446.7360000000335,296.06099999998696,null,null,766.43500000005588,{"$f":"H655+(COS(G654*PI()/180)*$O$1)*ABS(F654)*$O$2","v":674.95731052205201},{"$f":"(-1)*$Q$1*F654/$S$1","v":-18.820708775423235}]
[null,1618.6759999999776,489.57900000002701,1139.7540000000736,1618.6759999999776,null,null,1082.6696666666928,{"$f":"H656+(SIN((G654)*PI()/180)*$O$1)*ABS(F654)*$O$2","v":1104.7447498601539}]
[null,"HAS","18HD08(47)","MW125S","HAS",1.6909188046188117E-3,156.32392714467696]
[null,296.06099999998696,556.50800000014715,1270.5770000000484,296.06099999998696,null,null,707.71533333339414,{"$f":"H658+(COS(G657*PI()/180)*$O$1)*ABS(F657)*$O$2","v":643.19055023884403},{"$f":"(-1)*$Q$1*F657/$S$1","v":-14.090990038490098}]
[null,1618.6759999999776,489.57900000002701,498.1260000000475,1618.6759999999776,null,null,868.79366666668409,{"$f":"H659+(SIN((G657)*PI()/180)*$O$1)*ABS(F657)*$O$2","v":897.08593368829168}]
[null,"HAS","18HD08(47)","MW133S","HAS",1.5559050241927593E-3,152.52628491085287]
[null,296.06099999998696,556.50800000014715,2559.1700000001583,296.06099999998696,null,null,1137.2463333334308,{"$f":"H661+(COS(G660*PI()/180)*$O$1)*ABS(F660)*$O$2","v":1079.7282476874973},{"$f":"(-1)*$Q$1*F660/$S$1","v":-12.965875201606329}]
[null,1618.6759999999776,489.57900000002701,830.26100000005681,1618.6759999999776,null,null,979.50533333335386,{"$f":"H662+(SIN((G660)*PI()/180)*$O$1)*ABS(F660)*$O$2","v":1009.4138240545152}]
[null,"HAS","18HD08(47)","MW132S","HAS",1.9795181930601052E-3,162.31999188358384]
[null,296.06099999998696,556.50800000014715,1997.7360000000335,296.06099999998696,null,null,950.10166666672251,{"$f":"H664+(COS(G663*PI()/180)*$O$1)*ABS(F663)*$O$2","v":871.51747436063067},{"$f":"(-1)*$Q$1*F663/$S$1","v":-16.495984942167546}]
[null,1618.6759999999776,489.57900000002701,1434.6950000000652,1618.6759999999776,null,null,1180.9833333333565,{"$f":"H665+(SIN((G663)*PI()/180)*$O$1)*ABS(F663)*$O$2","v":1206.0325389076781}]
[null,"HAS","18HD09(62)","18HD03(57)","HAS",2.2310416237667397E-3,156.12936379772157]
[null,296.06099999998696,451.2160000000149,1446.7360000000335,296.06099999998696,null,null,731.3376666666785,{"$f":"H667+(COS(G666*PI()/180)*$O$1)*ABS(F666)*$O$2","v":646.32926671517976},{"$f":"(-1)*$Q$1*F666/$S$1","v":-18.592013531389497}]
[null,1618.6759999999776,695.53300000005402,1139.7540000000736,1618.6759999999776,null,null,1151.3210000000352,{"$f":"H668+(SIN((G666)*PI()/180)*$O$1)*ABS(F666)*$O$2","v":1188.9394278841226}]
[null,"HAS","18HD09(62)","MW125S","HAS",1.5353623932271927E-3,136.39668395210469]
[null,296.06099999998696,451.2160000000149,1270.5770000000484,296.06099999998696,null,null,672.61800000001676,{"$f":"H670+(COS(G669*PI()/180)*$O$1)*ABS(F669)*$O$2","v":626.29279331496321},{"$f":"(-1)*$Q$1*F669/$S$1","v":-12.794686610226607}]
[null,1618.6759999999776,695.53300000005402,498.1260000000475,1618.6759999999776,null,null,937.44500000002643,{"$f":"H671+(SIN((G669)*PI()/180)*$O$1)*ABS(F669)*$O$2","v":981.56501090137226}]
[null,"HAS","18HD09(62)","MW133S","HAS",1.6372423947026871E-3,140.91952820291922]
[null,296.06099999998696,451.2160000000149,2559.1700000001583,296.06099999998696,null,null,1102.1490000000533,{"$f":"H673+(COS(G672*PI()/180)*$O$1)*ABS(F672)*$O$2","v":1049.1936693277598},{"$f":"(-1)*$Q$1*F672/$S$1","v":-13.643686622522393}]
[null,1618.6759999999776,695.53300000005402,830.26100000005681,1618.6759999999776,null,null,1048.1566666666961,{"$f":"H674+(SIN((G672)*PI()/180)*$O$1)*ABS(F672)*$O$2","v":1091.1623357084395}]
[null,"HAS","18HD09(62)","MW132S","HAS",2.0727265397847221E-3,153.19155295876163]
[null,296.06099999998696,451.2160000000149,1997.7360000000335,296.06099999998696,null,null,915.00433333334513,{"$f":"H676+(COS(G675*PI()/180)*$O$1)*ABS(F675)*$O$2","v":837.92314516776901},{"$f":"(-1)*$Q$1*F675/$S$1","v":-17.272721164872685}]
[null,1618.6759999999776,695.53300000005402,1434.6950000000652,1618.6759999999776,null,null,1249.6346666666989,{"$f":"H677+(SIN((G675)*PI()/180)*$O$1)*ABS(F675)*$O$2","v":1288.5854412670719}]
[null,"HAS","HAH","18HD03(57)","HAS",2.2775812176490263E-3,145.73119532420986]
[null,296.06099999998696,470.84499999997206,1446.7360000000335,296.06099999998696,null,null,737.88066666666418,{"$f":"H679+(COS(G678*PI()/180)*$O$1)*ABS(F678)*$O$2","v":659.45547985280859},{"$f":"(-1)*$Q$1*F678/$S$1","v":-18.979843480408555}]
[null,1618.6759999999776,884.9089999999851,1139.7540000000736,1618.6759999999776,null,null,1214.4463333333454,{"$f":"H680+(SIN((G678)*PI()/180)*$O$1)*ABS(F678)*$O$2","v":1267.8818228205018}]
[null,"HAS","HAH","MW125S","HAS",1.685547921260517E-3,106.09033256746559]
[null,296.06099999998696,470.84499999997206,1270.5770000000484,296.06099999998696,null,null,679.16100000000245,{"$f":"H682+(COS(G681*PI()/180)*$O$1)*ABS(F681)*$O$2","v":659.69625478557191},{"$f":"(-1)*$Q$1*F681/$S$1","v":-14.046232677170977}]
[null,1618.6759999999776,884.9089999999851,498.1260000000475,1618.6759999999776,null,null,1000.5703333333367,{"$f":"H683+(SIN((G681)*PI()/180)*$O$1)*ABS(F681)*$O$2","v":1068.050256305047}]
[null,"HAS","HAH","MW133S","HAS",1.8435075951459025E-3,127.43185277333228]
[null,296.06099999998696,470.84499999997206,2559.1700000001583,296.06099999998696,null,null,1108.6920000000391,{"$f":"H685+(COS(G684*PI()/180)*$O$1)*ABS(F684)*$O$2","v":1062.0038344283605},{"$f":"(-1)*$Q$1*F684/$S$1","v":-15.362563292882523}]
[null,1618.6759999999776,884.9089999999851,830.26100000005681,1618.6759999999776,null,null,1111.2820000000065,{"$f":"H686+(SIN((G684)*PI()/180)*$O$1)*ABS(F684)*$O$2","v":1172.2772782496143}]
[null,"HAS","HAH","MW132S","HAS",2.2286193845846613E-3,144.33049651142952]
[null,296.06099999998696,470.84499999997206,1997.7360000000335,296.06099999998696,null,null,921.54733333333081,{"$f":"H688+(COS(G687*PI()/180)*$O$1)*ABS(F687)*$O$2","v":846.10912337888908},{"$f":"(-1)*$Q$1*F687/$S$1","v":-18.571828204872176}]
[null,1618.6759999999776,884.9089999999851,1434.6950000000652,1618.6759999999776,null,null,1312.7600000000093,{"$f":"H689+(SIN((G687)*PI()/180)*$O$1)*ABS(F687)*$O$2","v":1366.9069902270915}]
[null,"HAS","18HD03(57)","MW125S","HAS",2.4679350590534697E-3,182.74186934241328]
[null,296.06099999998696,1446.7360000000335,1270.5770000000484,296.06099999998696,null,null,1004.4580000000229,{"$f":"H691+(COS(G690*PI()/180)*$O$1)*ABS(F690)*$O$2","v":901.74509459988644},{"$f":"(-1)*$Q$1*F690/$S$1","v":-20.566125492112249}]
[null,1618.6759999999776,1139.7540000000736,498.1260000000475,1618.6759999999776,null,null,1085.5186666666996,{"$f":"H692+(SIN((G690)*PI()/180)*$O$1)*ABS(F690)*$O$2","v":1080.5996212109883}]
[null,"HAS","18HD03(57)","MW132S","HAS",2.3396430723615124E-3,139.83203434442754]
[null,296.06099999998696,1446.7360000000335,1997.7360000000335,296.06099999998696,null,null,1246.8443333333514,{"$f":"H694+(COS(G693*PI()/180)*$O$1)*ABS(F693)*$O$2","v":1172.3504110592496},{"$f":"(-1)*$Q$1*F693/$S$1","v":-19.497025603012602}]
[null,1618.6759999999776,1139.7540000000736,1434.6950000000652,1618.6759999999776,null,null,1397.7083333333721,{"$f":"H695+(SIN((G693)*PI()/180)*$O$1)*ABS(F693)*$O$2","v":1460.5892185715215}]
[null,"HAS","MW125S","MW133S","HAS",1.5876183224188766E-3,146.68579222358636]
[null,296.06099999998696,1270.5770000000484,2559.1700000001583,296.06099999998696,null,null,1375.269333333398,{"$f":"H697+(COS(G696*PI()/180)*$O$1)*ABS(F696)*$O$2","v":1319.9890459283388},{"$f":"(-1)*$Q$1*F696/$S$1","v":-13.230152686823972}]
[null,1618.6759999999776,498.1260000000475,830.26100000005681,1618.6759999999776,null,null,982.35433333336061,{"$f":"H698+(SIN((G696)*PI()/180)*$O$1)*ABS(F696)*$O$2","v":1018.6863209934234}]
[null,"HAS","MW125S","MW132S","HAS",1.9459444151788557E-3,169.24341942287143]
[null,296.06099999998696,1270.5770000000484,1997.7360000000335,296.06099999998696,null,null,1188.1246666666896,{"$f":"H700+(COS(G699*PI()/180)*$O$1)*ABS(F699)*$O$2","v":1108.4683264806742},{"$f":"(-1)*$Q$1*F699/$S$1","v":-16.216203459823799}]
[null,1618.6759999999776,498.1260000000475,1434.6950000000652,1618.6759999999776,null,null,1183.8323333333635,{"$f":"H701+(SIN((G699)*PI()/180)*$O$1)*ABS(F699)*$O$2","v":1198.9650407722136}]
[null,"HAS","MW133S","MW132S","HAS",2.4839045296895096E-3,212.48499172220812]
[null,296.06099999998696,2559.1700000001583,1997.7360000000335,296.06099999998696,null,null,1617.6556666667263,{"$f":"H703+(COS(G702*PI()/180)*$O$1)*ABS(F702)*$O$2","v":1530.3534436998798},{"$f":"(-1)*$Q$1*F702/$S$1","v":-20.699204414079247}]
[null,1618.6759999999776,830.26100000005681,1434.6950000000652,1618.6759999999776,null,null,1294.5440000000333,{"$f":"H704+(SIN((G702)*PI()/180)*$O$1)*ABS(F702)*$O$2","v":1238.9584942503961}]
[null,"18HD06","18HD08(47)","18HD03(57)","18HD06",1.6469248785340948E-3,188.61537400408477]
[null,782.77399999997579,556.50800000014715,1446.7360000000335,782.77399999997579,null,null,928.67266666671878,{"$f":"H706+(COS(G705*PI()/180)*$O$1)*ABS(F705)*$O$2","v":860.82511073699902},{"$f":"(-1)*$Q$1*F705/$S$1","v":-13.724373987784125}]
[null,131.10900000005495,489.57900000002701,1139.7540000000736,131.10900000005495,null,null,586.81400000005181,{"$f":"H707+(SIN((G705)*PI()/180)*$O$1)*ABS(F705)*$O$2","v":576.53439941064676}]
[null,"18HD06","18HD08(47)","MW125S","18HD06",1.5498623310603065E-3,187.03462852736212]
[null,782.77399999997579,556.50800000014715,1270.5770000000484,782.77399999997579,null,null,869.95300000005716,{"$f":"H709+(COS(G708*PI()/180)*$O$1)*ABS(F708)*$O$2","v":805.86152269771446},{"$f":"(-1)*$Q$1*F708/$S$1","v":-12.915519425502556}]
[null,131.10900000005495,489.57900000002701,498.1260000000475,131.10900000005495,null,null,372.93800000004313,{"$f":"H710+(SIN((G708)*PI()/180)*$O$1)*ABS(F708)*$O$2","v":365.02923347379874}]
[null,"18HD06","18HD08(47)","MW133S","18HD06",1.2563602540729053E-3,180.5418254280128]
[null,782.77399999997579,556.50800000014715,2559.1700000001583,782.77399999997579,null,null,1299.4840000000938,{"$f":"H712+(COS(G711*PI()/180)*$O$1)*ABS(F711)*$O$2","v":1247.1379967667015},{"$f":"(-1)*$Q$1*F711/$S$1","v":-10.469668783940877}]
[null,131.10900000005495,489.57900000002701,830.26100000005681,131.10900000005495,null,null,483.6496666667129,{"$f":"H713+(SIN((G711)*PI()/180)*$O$1)*ABS(F711)*$O$2","v":483.15463472296335}]
[null,"18HD06","18HD08(47)","MW132S","18HD06",1.4218763773992469E-3,184.57945419555676]
[null,782.77399999997579,556.50800000014715,1997.7360000000335,782.77399999997579,null,null,1112.3393333333854,{"$f":"H715+(COS(G714*PI()/180)*$O$1)*ABS(F714)*$O$2","v":1053.2836191275044},{"$f":"(-1)*$Q$1*F714/$S$1","v":-11.848969811660391}]
[null,131.10900000005495,489.57900000002701,1434.6950000000652,131.10900000005495,null,null,685.12766666671575,{"$f":"H716+(SIN((G714)*PI()/180)*$O$1)*ABS(F714)*$O$2","v":680.39747009846701}]
[null,"18HD06","18HD09(62)","18HD03(57)","18HD06",1.5238326977234931E-3,192.92846602811076]
[null,782.77399999997579,451.2160000000149,1446.7360000000335,782.77399999997579,null,null,893.5753333333414,{"$f":"H718+(COS(G717*PI()/180)*$O$1)*ABS(F717)*$O$2","v":831.69184255155756},{"$f":"(-1)*$Q$1*F717/$S$1","v":-12.698605814362443}]
[null,131.10900000005495,695.53300000005402,1139.7540000000736,131.10900000005495,null,null,655.46533333339414,{"$f":"H719+(SIN((G717)*PI()/180)*$O$1)*ABS(F717)*$O$2","v":641.25976015330502}]
[null,"18HD06","18HD09(62)","MW125S","18HD06",1.4773362695017413E-3,192.35889998211917]
[null,782.77399999997579,451.2160000000149,1270.5770000000484,782.77399999997579,null,null,834.85566666667967,{"$f":"H721+(COS(G720*PI()/180)*$O$1)*ABS(F720)*$O$2","v":774.72647615572669},{"$f":"(-1)*$Q$1*F720/$S$1","v":-12.311135579181178}]
[null,131.10900000005495,695.53300000005402,498.1260000000475,131.10900000005495,null,null,441.58933333338547,{"$f":"H722+(SIN((G720)*PI()/180)*$O$1)*ABS(F720)*$O$2","v":428.41428381841092}]
[null,"18HD06","18HD09(62)","MW133S","18HD06",1.2061296277811669E-3,188.09931330566192]
[null,782.77399999997579,451.2160000000149,2559.1700000001583,782.77399999997579,null,null,1264.3866666667163,{"$f":"H724+(COS(G723*PI()/180)*$O$1)*ABS(F723)*$O$2","v":1214.6325457293747},{"$f":"(-1)*$Q$1*F723/$S$1","v":-10.051080231509724}]
[null,131.10900000005495,695.53300000005402,830.26100000005681,131.10900000005495,null,null,552.3010000000553,{"$f":"H725+(SIN((G723)*PI()/180)*$O$1)*ABS(F723)*$O$2","v":545.22054837190888}]
[null,"18HD06","18HD09(62)","MW132S","18HD06",1.313940781367425E-3,190.01764266628675]
[null,782.77399999997579,451.2160000000149,1997.7360000000335,782.77399999997579,null,null,1077.2420000000081,{"$f":"H727+(COS(G726*PI()/180)*$O$1)*ABS(F726)*$O$2","v":1023.3291353971855},{"$f":"(-1)*$Q$1*F726/$S$1","v":-10.949506511395208}]
[null,131.10900000005495,695.53300000005402,1434.6950000000652,131.10900000005495,null,null,753.77900000005809,{"$f":"H728+(SIN((G726)*PI()/180)*$O$1)*ABS(F726)*$O$2","v":744.25558929827366}]
[null,"18HD06","HAH","18HD03(57)","18HD06",1.4971892700232287E-3,194.0054940011234]
[null,782.77399999997579,470.84499999997206,1446.7360000000335,782.77399999997579,null,null,900.11833333332709,{"$f":"H730+(COS(G729*PI()/180)*$O$1)*ABS(F729)*$O$2","v":839.58993281687583},{"$f":"(-1)*$Q$1*F729/$S$1","v":-12.476577250193573}]
[null,131.10900000005495,884.9089999999851,1139.7540000000736,131.10900000005495,null,null,718.59066666670458,{"$f":"H731+(SIN((G729)*PI()/180)*$O$1)*ABS(F729)*$O$2","v":703.4930765304855}]
[null,"18HD06","HAH","MW125S","18HD06",1.4610406275341764E-3,193.79421422546352]
[null,782.77399999997579,470.84499999997206,1270.5770000000484,782.77399999997579,null,null,841.39866666666546,{"$f":"H733+(COS(G732*PI()/180)*$O$1)*ABS(F732)*$O$2","v":782.2777573736131},{"$f":"(-1)*$Q$1*F732/$S$1","v":-12.175338562784804}]
[null,131.10900000005495,884.9089999999851,498.1260000000475,131.10900000005495,null,null,504.71466666669585,{"$f":"H734+(SIN((G732)*PI()/180)*$O$1)*ABS(F732)*$O$2","v":490.19950864745476}]
[null,"18HD06","HAH","MW133S","18HD06",1.1903382097955759E-3,191.79788980562461]
[null,782.77399999997579,470.84499999997206,2559.1700000001583,782.77399999997579,null,null,1270.9296666667021,{"$f":"H736+(COS(G735*PI()/180)*$O$1)*ABS(F735)*$O$2","v":1222.3799908552248},{"$f":"(-1)*$Q$1*F735/$S$1","v":-9.9194850816297979}]
[null,131.10900000005495,884.9089999999851,830.26100000005681,131.10900000005495,null,null,615.42633333336562,{"$f":"H737+(SIN((G735)*PI()/180)*$O$1)*ABS(F735)*$O$2","v":605.28564372578148}]
[null,"18HD06","HAH","MW132S","18HD06",1.2735259934853857E-3,192.50306535149491]
[null,782.77399999997579,470.84499999997206,1997.7360000000335,782.77399999997579,null,null,1083.7849999999937,{"$f":"H739+(COS(G738*PI()/180)*$O$1)*ABS(F738)*$O$2","v":1031.9798502635913},{"$f":"(-1)*$Q$1*F738/$S$1","v":-10.612716612378215}]
[null,131.10900000005495,884.9089999999851,1434.6950000000652,131.10900000005495,null,null,816.90433333336841,{"$f":"H740+(SIN((G738)*PI()/180)*$O$1)*ABS(F738)*$O$2","v":805.41650028465415}]
[null,"18HD06","18HD03(57)","MW125S","18HD06",1.4281089707161674E-3,197.1081190204211]
[null,782.77399999997579,1446.7360000000335,1270.5770000000484,782.77399999997579,null,null,1166.6956666666858,{"$f":"H742+(COS(G741*PI()/180)*$O$1)*ABS(F741)*$O$2","v":1109.8241224810624},{"$f":"(-1)*$Q$1*F741/$S$1","v":-11.900908089301394}]
[null,131.10900000005495,1139.7540000000736,498.1260000000475,131.10900000005495,null,null,589.66300000005867,{"$f":"H743+(SIN((G741)*PI()/180)*$O$1)*ABS(F741)*$O$2","v":572.15820649391685}]
[null,"18HD06","18HD03(57)","MW133S","18HD06",1.1990408300181093E-3,213.36072208883098]
[null,782.77399999997579,1446.7360000000335,2559.1700000001583,782.77399999997579,null,null,1596.2266666667226,{"$f":"H745+(COS(G744*PI()/180)*$O$1)*ABS(F744)*$O$2","v":1554.4987949073759},{"$f":"(-1)*$Q$1*F744/$S$1","v":-9.9920069168175782}]
[null,131.10900000005495,1139.7540000000736,830.26100000005681,131.10900000005495,null,null,700.37466666672844,{"$f":"H746+(SIN((G744)*PI()/180)*$O$1)*ABS(F744)*$O$2","v":672.90122905730721}]
[null,"18HD06","MW133S","MW132S","18HD06",1.1735731017940799E-3,200.4192943121364]
[null,782.77399999997579,2559.1700000001583,1997.7360000000335,782.77399999997579,null,null,1779.8933333333891,{"$f":"H748+(COS(G747*PI()/180)*$O$1)*ABS(F747)*$O$2","v":1734.0670369307468},{"$f":"(-1)*$Q$1*F747/$S$1","v":-9.7797758482839985}]
[null,131.10900000005495,830.26100000005681,1434.6950000000652,131.10900000005495,null,null,798.68833333339228,{"$f":"H749+(SIN((G747)*PI()/180)*$O$1)*ABS(F747)*$O$2","v":781.62811794541574}]
[null,"18HD08(47)","18HD09(62)","HAH","18HD08(47)",1.2934468556183771E-3,203.24496721752007]
[null,556.50800000014715,451.2160000000149,470.84499999997206,556.50800000014715,null,null,492.85633333337802,{"$f":"H751+(COS(G750*PI()/180)*$O$1)*ABS(F750)*$O$2","v":443.33748142442829},{"$f":"(-1)*$Q$1*F750/$S$1","v":-10.77872379681981}]
[null,489.57900000002701,695.53300000005402,884.9089999999851,489.57900000002701,null,null,690.007000000022,{"$f":"H752+(SIN((G750)*PI()/180)*$O$1)*ABS(F750)*$O$2","v":668.7371745935277}]
[null,"18HD08(47)","18HD09(62)","18HD03(57)","18HD08(47)",1.495247314899873E-3,203.76289499642678]
[null,556.50800000014715,451.2160000000149,1446.7360000000335,556.50800000014715,null,null,818.15333333339856,{"$f":"H754+(COS(G753*PI()/180)*$O$1)*ABS(F753)*$O$2","v":761.13327232333938},{"$f":"(-1)*$Q$1*F753/$S$1","v":-12.460394290832275}]
[null,489.57900000002701,695.53300000005402,1139.7540000000736,489.57900000002701,null,null,774.95533333338483,{"$f":"H755+(SIN((G753)*PI()/180)*$O$1)*ABS(F753)*$O$2","v":749.8505869796719}]
[null,"18HD08(47)","18HD09(62)","MW125S","18HD08(47)",1.6789065133721714E-3,204.12587726778449]
[null,556.50800000014715,451.2160000000149,1270.5770000000484,556.50800000014715,null,null,759.43366666673683,{"$f":"H757+(COS(G756*PI()/180)*$O$1)*ABS(F756)*$O$2","v":695.58977225544152},{"$f":"(-1)*$Q$1*F756/$S$1","v":-13.990887611434761}]
[null,489.57900000002701,695.53300000005402,498.1260000000475,489.57900000002701,null,null,561.07933333337621,{"$f":"H758+(SIN((G756)*PI()/180)*$O$1)*ABS(F756)*$O$2","v":532.48596783901121}]
[null,"18HD08(47)","HAH","18HD03(57)","18HD08(47)",1.5084182680535267E-3,201.65906230927487]
[null,556.50800000014715,470.84499999997206,1446.7360000000335,556.50800000014715,null,null,824.69633333338425,{"$f":"H760+(COS(G759*PI()/180)*$O$1)*ABS(F759)*$O$2","v":766.28305478217635},{"$f":"(-1)*$Q$1*F759/$S$1","v":-12.570152233779391}]
[null,489.57900000002701,884.9089999999851,1139.7540000000736,489.57900000002701,null,null,838.08066666669527,{"$f":"H761+(SIN((G759)*PI()/180)*$O$1)*ABS(F759)*$O$2","v":814.88353174859128}]
[null,"18HD08(47)","HAH","MW125S","18HD08(47)",1.6413431088008199E-3,200.88900148430957]
[null,556.50800000014715,470.84499999997206,1270.5770000000484,556.50800000014715,null,null,765.97666666672251,{"$f":"H763+(COS(G762*PI()/180)*$O$1)*ABS(F762)*$O$2","v":702.08239807076416},{"$f":"(-1)*$Q$1*F762/$S$1","v":-13.677859240006834}]
[null,489.57900000002701,884.9089999999851,498.1260000000475,489.57900000002701,null,null,624.20466666668653,{"$f":"H764+(SIN((G762)*PI()/180)*$O$1)*ABS(F762)*$O$2","v":599.81987067977013}]
[null,"18HD08(47)","HAH","MW132S","18HD08(47)",1.2658240720167129E-3,203.48852768112806]
[null,556.50800000014715,470.84499999997206,1997.7360000000335,556.50800000014715,null,null,1008.3630000000509,{"$f":"H766+(COS(G765*PI()/180)*$O$1)*ABS(F765)*$O$2","v":959.99059335153731},{"$f":"(-1)*$Q$1*F765/$S$1","v":-10.548533933472608}]
[null,489.57900000002701,884.9089999999851,1434.6950000000652,489.57900000002701,null,null,936.3943333333591,{"$f":"H767+(SIN((G765)*PI()/180)*$O$1)*ABS(F765)*$O$2","v":915.37292808367579}]
[null,"18HD08(47)","18HD03(57)","MW125S","18HD08(47)",1.5806756896054306E-3,193.65447325190613]
[null,556.50800000014715,1446.7360000000335,1270.5770000000484,556.50800000014715,null,null,1091.2736666667431,{"$f":"H769+(COS(G768*PI()/180)*$O$1)*ABS(F768)*$O$2","v":1027.2736226187953},{"$f":"(-1)*$Q$1*F768/$S$1","v":-13.172297413378589}]
[null,489.57900000002701,1139.7540000000736,498.1260000000475,489.57900000002701,null,null,709.15300000004936,{"$f":"H770+(SIN((G768)*PI()/180)*$O$1)*ABS(F768)*$O$2","v":693.60533649316653}]
[null,"18HD08(47)","18HD03(57)","MW133S","18HD08(47)",1.4681107181241046E-3,221.98612563306853]
[null,556.50800000014715,1446.7360000000335,2559.1700000001583,556.50800000014715,null,null,1520.8046666667797,{"$f":"H772+(COS(G771*PI()/180)*$O$1)*ABS(F771)*$O$2","v":1475.3356361383815},{"$f":"(-1)*$Q$1*F771/$S$1","v":-12.23425598436754}]
[null,489.57900000002701,1139.7540000000736,830.26100000005681,489.57900000002701,null,null,819.86466666671913,{"$f":"H773+(SIN((G771)*PI()/180)*$O$1)*ABS(F771)*$O$2","v":778.94410032064559}]
[null,"18HD08(47)","MW125S","MW132S","18HD08(47)",1.5432263264137935E-3,177.19132945410564]
[null,556.50800000014715,1270.5770000000484,1997.7360000000335,556.50800000014715,null,null,1274.9403333334096,{"$f":"H775+(COS(G774*PI()/180)*$O$1)*ABS(F774)*$O$2","v":1210.7164791538066},{"$f":"(-1)*$Q$1*F774/$S$1","v":-12.860219386781614}]
[null,489.57900000002701,498.1260000000475,1434.6950000000652,489.57900000002701,null,null,807.46666666671319,{"$f":"H776+(SIN((G774)*PI()/180)*$O$1)*ABS(F774)*$O$2","v":810.61747945406171}]
[null,"18HD08(47)","MW133S","MW132S","18HD08(47)",1.2709635944072541E-3,202.22358481910834]
[null,556.50800000014715,2559.1700000001583,1997.7360000000335,556.50800000014715,null,null,1704.4713333334464,{"$f":"H778+(COS(G777*PI()/180)*$O$1)*ABS(F777)*$O$2","v":1655.448415346646},{"$f":"(-1)*$Q$1*F777/$S$1","v":-10.591363286727116}]
[null,489.57900000002701,830.26100000005681,1434.6950000000652,489.57900000002701,null,null,918.17833333338297,{"$f":"H779+(SIN((G777)*PI()/180)*$O$1)*ABS(F777)*$O$2","v":898.14890700996534}]
[null,"18HD09(62)","HAH","18HD03(57)","18HD09(62)",1.5012679724737759E-3,198.9064779592571]
[null,451.2160000000149,470.84499999997206,1446.7360000000335,451.2160000000149,null,null,789.59900000000687,{"$f":"H781+(COS(G780*PI()/180)*$O$1)*ABS(F780)*$O$2","v":730.42097254458417},{"$f":"(-1)*$Q$1*F780/$S$1","v":-12.510566437281467}]
[null,695.53300000005402,884.9089999999851,1139.7540000000736,695.53300000005402,null,null,906.7320000000376,{"$f":"H782+(SIN((G780)*PI()/180)*$O$1)*ABS(F780)*$O$2","v":886.46335719825925}]
[null,"18HD09(62)","HAH","MW125S","18HD09(62)",1.5583266394297822E-3,197.93976502362793]
[null,451.2160000000149,470.84499999997206,1270.5770000000484,451.2160000000149,null,null,730.87933333334513,{"$f":"H784+(COS(G783*PI()/180)*$O$1)*ABS(F783)*$O$2","v":669.10591091242054},{"$f":"(-1)*$Q$1*F783/$S$1","v":-12.986055328581518}]
[null,695.53300000005402,884.9089999999851,498.1260000000475,695.53300000005402,null,null,692.85600000002887,{"$f":"H785+(SIN((G783)*PI()/180)*$O$1)*ABS(F783)*$O$2","v":672.85637232023146}]
[null,"18HD09(62)","18HD03(57)","MW125S","18HD09(62)",1.5137802619519041E-3,195.06816280589706]
[null,451.2160000000149,1446.7360000000335,1270.5770000000484,451.2160000000149,null,null,1056.1763333333656,{"$f":"H787+(COS(G786*PI()/180)*$O$1)*ABS(F786)*$O$2","v":995.27082039237916},{"$f":"(-1)*$Q$1*F786/$S$1","v":-12.614835516265869}]
[null,695.53300000005402,1139.7540000000736,498.1260000000475,695.53300000005402,null,null,777.8043333333917,{"$f":"H788+(SIN((G786)*PI()/180)*$O$1)*ABS(F786)*$O$2","v":761.40706615387683}]
[null,"18HD09(62)","18HD03(57)","MW133S","18HD09(62)",1.6006370880873129E-3,224.95676202774672]
[null,451.2160000000149,1446.7360000000335,2559.1700000001583,451.2160000000149,null,null,1485.7073333334022,{"$f":"H790+(COS(G789*PI()/180)*$O$1)*ABS(F789)*$O$2","v":1438.5125358278381},{"$f":"(-1)*$Q$1*F789/$S$1","v":-13.338642400727608}]
[null,695.53300000005402,1139.7540000000736,830.26100000005681,695.53300000005402,null,null,888.51600000006147,{"$f":"H791+(SIN((G789)*PI()/180)*$O$1)*ABS(F789)*$O$2","v":841.39237942851582}]
[null,"18HD09(62)","MW125S","MW132S","18HD09(62)",1.3799822550737524E-3,182.0930282830841]
[null,451.2160000000149,1270.5770000000484,1997.7360000000335,451.2160000000149,null,null,1239.8430000000324,{"$f":"H793+(COS(G792*PI()/180)*$O$1)*ABS(F792)*$O$2","v":1182.3821002816558},{"$f":"(-1)*$Q$1*F792/$S$1","v":-11.499852125614604}]
[null,695.53300000005402,498.1260000000475,1434.6950000000652,695.53300000005402,null,null,876.11800000005553,{"$f":"H794+(SIN((G792)*PI()/180)*$O$1)*ABS(F792)*$O$2","v":874.0180056358405}]
[null,"18HD09(62)","MW133S","MW132S","18HD09(62)",1.2681745115904479E-3,202.17605220282445]
[null,451.2160000000149,2559.1700000001583,1997.7360000000335,451.2160000000149,null,null,1669.3740000000689,{"$f":"H796+(COS(G795*PI()/180)*$O$1)*ABS(F795)*$O$2","v":1620.4420978754802},{"$f":"(-1)*$Q$1*F795/$S$1","v":-10.568120929920399}]
[null,695.53300000005402,830.26100000005681,1434.6950000000652,695.53300000005402,null,null,986.8296666667253,{"$f":"H797+(SIN((G795)*PI()/180)*$O$1)*ABS(F795)*$O$2","v":966.88478125203289}]
[null,"HAH","18HD03(57)","MW125S","HAH",1.4972465434805536E-3,195.44038348844506]
[null,470.84499999997206,1446.7360000000335,1270.5770000000484,470.84499999997206,null,null,1062.7193333333514,{"$f":"H799+(COS(G798*PI()/180)*$O$1)*ABS(F798)*$O$2","v":1002.5856703084877},{"$f":"(-1)*$Q$1*F798/$S$1","v":-12.477054529004613}]
[null,884.9089999999851,1139.7540000000736,498.1260000000475,884.9089999999851,null,null,840.92966666670202,{"$f":"H800+(SIN((G798)*PI()/180)*$O$1)*ABS(F798)*$O$2","v":824.32048805347722}]
[null,"HAH","18HD03(57)","MW133S","HAH",1.8039942951403088E-3,228.54901287823822]
[null,470.84499999997206,1446.7360000000335,2559.1700000001583,470.84499999997206,null,null,1492.250333333388,{"$f":"H802+(COS(G801*PI()/180)*$O$1)*ABS(F801)*$O$2","v":1442.4917266771051},{"$f":"(-1)*$Q$1*F801/$S$1","v":-15.033285792835906}]
[null,884.9089999999851,1139.7540000000736,830.26100000005681,884.9089999999851,null,null,951.64133333337179,{"$f":"H803+(SIN((G801)*PI()/180)*$O$1)*ABS(F801)*$O$2","v":895.30242043249677}]
[null,"HAH","MW125S","MW133S","HAH",1.1708306434729139E-3,170.15360565390424]
[null,470.84499999997206,1270.5770000000484,2559.1700000001583,470.84499999997206,null,null,1433.5306666667263,{"$f":"H805+(COS(G804*PI()/180)*$O$1)*ABS(F804)*$O$2","v":1385.4646659761784},{"$f":"(-1)*$Q$1*F804/$S$1","v":-9.7569220289409504}]
[null,884.9089999999851,498.1260000000475,830.26100000005681,884.9089999999851,null,null,737.76533333336317,{"$f":"H806+(SIN((G804)*PI()/180)*$O$1)*ABS(F804)*$O$2","v":746.10786080332582}]
[null,"HAH","MW125S","MW132S","HAH",1.3078299693242985E-3,184.79197748828213]
[null,470.84499999997206,1270.5770000000484,1997.7360000000335,470.84499999997206,null,null,1246.3860000000179,{"$f":"H808+(COS(G807*PI()/180)*$O$1)*ABS(F807)*$O$2","v":1192.0835610012862},{"$f":"(-1)*$Q$1*F807/$S$1","v":-10.898583077702487}]
[null,884.9089999999851,498.1260000000475,1434.6950000000652,884.9089999999851,null,null,939.24333333336597,{"$f":"H809+(SIN((G807)*PI()/180)*$O$1)*ABS(F807)*$O$2","v":934.69108703855852}]
[null,"HAH","MW133S","MW132S","HAH",1.2642291532213752E-3,202.10843002605509]
[null,470.84499999997206,2559.1700000001583,1997.7360000000335,470.84499999997206,null,null,1675.9170000000547,{"$f":"H811+(COS(G810*PI()/180)*$O$1)*ABS(F810)*$O$2","v":1627.1138952930964},{"$f":"(-1)*$Q$1*F810/$S$1","v":-10.535242943511461}]
[null,884.9089999999851,830.26100000005681,1434.6950000000652,884.9089999999851,null,null,1049.9550000000356,{"$f":"H812+(SIN((G810)*PI()/180)*$O$1)*ABS(F810)*$O$2","v":1030.1297492341091}]
[null,"18HD03(57)","MW125S","MW133S","18HD03(57)",1.1012374586912613E-3,208.75674032719945]
[null,1446.7360000000335,1270.5770000000484,2559.1700000001583,1446.7360000000335,null,null,1758.8276666667468,{"$f":"H814+(COS(G813*PI()/180)*$O$1)*ABS(F813)*$O$2","v":1718.6017489428755},{"$f":"(-1)*$Q$1*F813/$S$1","v":-9.1769788224271789}]
[null,1139.7540000000736,498.1260000000475,830.26100000005681,1139.7540000000736,null,null,822.713666666726,{"$f":"H815+(SIN((G813)*PI()/180)*$O$1)*ABS(F813)*$O$2","v":800.63881556973649}]
[null,"18HD03(57)","MW125S","MW132S","18HD03(57)",8.9584882850136352E-4,223.47398649623852]
[null,1446.7360000000335,1270.5770000000484,1997.7360000000335,1446.7360000000335,null,null,1571.6830000000384,{"$f":"H817+(COS(G816*PI()/180)*$O$1)*ABS(F816)*$O$2","v":1544.5952628740217},{"$f":"(-1)*$Q$1*F816/$S$1","v":-7.4654069041780291}]
[null,1139.7540000000736,498.1260000000475,1434.6950000000652,1139.7540000000736,null,null,1024.1916666667287,{"$f":"H818+(SIN((G816)*PI()/180)*$O$1)*ABS(F816)*$O$2","v":998.50972741916507}]
[null,"18HD03(57)","MW133S","MW132S","18HD03(57)",8.9584994442255003E-4,192.84453603005215]
[null,1446.7360000000335,2559.1700000001583,1997.7360000000335,1446.7360000000335,null,null,2001.2140000000752,{"$f":"H820+(COS(G819*PI()/180)*$O$1)*ABS(F819)*$O$2","v":1964.8209601296358},{"$f":"(-1)*$Q$1*F819/$S$1","v":-7.4654162035212508}]
[null,1139.7540000000736,830.26100000005681,1434.6950000000652,1139.7540000000736,null,null,1134.9033333333985,{"$f":"H821+(SIN((G819)*PI()/180)*$O$1)*ABS(F819)*$O$2","v":1126.6052837864536}]
[null,"MW125S","MW133S","MW132S","MW125S",1.0692501879292834E-3,198.08711425370663]
[null,1270.5770000000484,2559.1700000001583,1997.7360000000335,1270.5770000000484,null,null,1942.4943333334134,{"$f":"H823+(COS(G822*PI()/180)*$O$1)*ABS(F822)*$O$2","v":1900.1437579894557},{"$f":"(-1)*$Q$1*F822/$S$1","v":-8.9104182327440284}]
[null,498.1260000000475,830.26100000005681,1434.6950000000652,498.1260000000475,null,null,921.02733333338983,{"$f":"H824+(SIN((G822)*PI()/180)*$O$1)*ABS(F822)*$O$2","v":907.19557295749439}]

{"sheet":"Equations","index":6,"n_rows":0,"n_cols":0,"rows_kept":0,"cut":false,"hidden":false,"merged":[]}

{"sheet":"ExampleData","index":7,"n_rows":43,"n_cols":4,"rows_kept":43,"cut":false,"hidden":false,"merged":[]}
["Data from Ferrey et al., 2000"]
["Well ID","x","y","water elevation"]
["MW-6S",0,10,890.47]
["MW-4S",75,-20,890.13]
["MW-8S",205,-160,889.48]
["MW-1S",290,220,889.47900000000004]
["MW-7S",425,-65,888.64]
["MW-3S",420,7,888.47950000000003]
["MW-5S",670,0,887.72]
[]
[]
["Data from Schillig et al, 2015"]
["Well ID","x","y","water elevation"]
["WO35",94.037079999980051,76.32147999946028,297.83699999999999]
["WO74",170.15214999997988,40.30500999931246,297.66200000000003]
["WO77",161.67000000004191,52.286999999545515,297.70400000000001]
["WO78",158.23999999999069,48.626999999396503,297.697]
["WO79",154.84000000002561,44.936999998986721,297.69600000000003]
["WO80",151.40000000002328,41.08699999935925,297.69899999999996]
["WO64",0,77.396999998949468,297.97800000000001]
["WO75S",131.36044000001857,0,297.745]
[]
[]
["Skuldeleve data"]
["Well","x","y","z"]
["W12",75,100,4.46]
["W11",60,98,4.41]
["W13",75,93,4.45]
["W5",34,93,4.55]
["W1",2,91,4.53]
["W16",79,85,4.47]
["W14",68,81,4.34]
["W2",22.5,74,4.45]
["W3",26,71,4.4400000000000004]
["W15",72,64,4.29]
["W6",34,58,4.3600000000000003]
["W9",53,48,4.26]
["W10",55.5,42.5,4.26]
["W4",24,40,4.1399999999999997]
["W17",78,27.5,4.07]
["W18",75,17,4.12]
["W8",56,2.5,4.03]
["W7",37.5,0,4.01]