{"text_format":"1","workbook":"xlsx","n_sheets":7,"sheets":["Instructions","Input","Examples","Equations","References"," Report Grain Size","Report K"],"not_rendered":{"charts":6,"images":18,"macros":1,"external_links":0,"defined_names":28,"comments":0,"pivot_tables":0},"unopened":[],"bounds":{"document_bytes":16777216,"sheet_cells":100000,"rows_first":2000,"rows_last":500,"rows_between":2000,"halvings":0,"cell_chars":16384,"cell_head_chars":4096},"cells_cut":0,"cells_raw":0,"read":"whole","date_system":"1900"}

{"sheet":"Instructions","index":0,"n_rows":0,"n_cols":0,"rows_kept":0,"cut":false,"hidden":false,"merged":[]}

{"sheet":"Input","index":1,"n_rows":176,"n_cols":40,"rows_kept":176,"cut":false,"hidden":false,"merged":[[1,10,6,13]]}
[]
[null,null,null,null,null,null,null,null,null,null," Moderately well sorted  sand low in fines ",null,null,null,null,null,null,null,null,null,"Shephard","Zunker","Terzaghi","Barr","Plotted Data - Line",null,"ü",null,"Estimation of Hydraulic Conductivity","cm/s","m/s","m/d",null,"Estimation of Hydraulic Conductivity","cm/s","m/s","m/d",null,"A. mean","G mean"]
[null,null,null,null,null,null,null,null,null,null,null,null,null,null,null,null,null,null,null,null,142.80000000000001,1.5499999999999999E-3,8.3999999999999995E-3,4.0200000000000001E-3,1.9151279557956367,100.78451695560115,null,{"$f":"IF(ISBLANK(F19)=FALSE,1,0)","v":0},"Hazen",{"$f":"IF($AB3>0,$AB3*H19,\" \")","v":" "},{"$f":"IF($AB3>0,$AB3*I19,\" \")","v":" "}," ",null,"Hazen",{"$f":"IF($AB3=0,H19,\" \")","v":3.0006144042093508E-2},{"$f":"IF($AB3=0,I19,\" \")","v":3.0006144042093509E-4},25.925308452368792,null,{"$f":"$J$36","v":26.957224663601917},{"$f":"$J$35","v":22.145764270745261}]
[null,null,null,null,null,null,null,null,null,null,null,null,null,null,null,null,null,null,null,null,null,null,0.15,0.15,1.8740522534258721,101.02196189158053,null,{"$f":"IF(ISBLANK(F20)=FALSE,1,0)","v":1},"Hazen K (cm/s) = d102 (mm2)",{"$f":"IF($AB4>0,$AB4*H20,\" \")","v":2.2499999999999999E-2},{"$f":"IF($AB4>0,$AB4*I20,\" \")","v":2.2499999999999999E-4},{"$f":"IF($AB4>0,$AB4*J20,\" \")","v":19.440000000000001},null,"Hazen K (cm/s) = d102 (mm2)",{"$f":"IF($AB4=0,H20,\" \")","v":" "},{"$f":"IF($AB4=0,I20,\" \")","v":" "},{"$f":"IF($AB4=0,J20,\" \")","v":" "},null,26.957224663601917,22.145764270745261]
[null,null,"Mass Sample (g):",null,"T (oC)",null,null,null,null,null,null,null,null,null,null,null,null,null,null,null,null,null,null,null,1.8338575435349984,101.16634149173996,null,1,"Slichter",9.5963209315535949E-3,9.5963209315535949E-5,8.2912212848623064,null,"Slichter"," "," "," ",null,26.957224663601917,22.145764270745261]
[null,null,100,null,20,null,null,null,null,null,null,null,null,null,null,null,null,null,null,null,null,0.15,0.15,0.15,1.7945249305788595,101.22466523369,null,0,"Terzaghi"," "," "," ",null,"Terzaghi",1.6695337658127831E-2,1.669533765812783E-4,14.424771736622445,null,26.957224663601917,22.145764270745261]
["Sieve opening               di (f)","Sieve opening (ps)              di (mm)","Mass of retained (mr) \n(g)","mass fraction (mf)","Percent Passing (pp)",null,null,null,null,null,null,null,null,null,null,null,null,null,null,null,null,null,null,null,1.7560359242853054,101.20349888710568,null,1,"Beyer",2.4807909969877112E-2,2.4807909969877111E-4,21.43403421397382,null,"Beyer"," "," "," ",null,26.957224663601917,22.145764270745261]
[{"$f":"IF(ISBLANK(B8),\" \",3.3193*LOG(B8))","v":0.99920886460745284},2,0,0,100,null,null,null,null,null,"Effective Grain Diameters (mm)",null,"Other Useful Parameters",null,null,null,null,null,null,null,null,"ne for Dg","Dgeom approx",null,1.7183724309619097,101.10899155668706,null,1,"Sauerbrei",3.3908920426943837E-2,3.3908920426943838E-4,29.297307248879473,null,"Sauerbrei"," "," "," ",null,26.957224663601917,22.145764270745261]
[-0.2860776797827293,0.82,20,0.2,80,null,null,null,null,null,"d10",0.15,"Uniformity Coef.",{"$f":"L13/L9","v":3.666666666666667},null,null,null,null,null,null,null,0,{"$f":"2^((N17+N18+N19)/3)","v":0.48887256556762343},null,1.6815167449901196,100.94690108164282,null,0,"Kruger"," "," "," ",null,"Kruger",5.162397278775268E-2,5.1623972787752685E-4,44.603112488618315,null,26.957224663601917,22.145764270745261]
[-0.86181412476175634,0.55000000000000004,20,0.2,60,null,null,null,null,null,"d17",0.24100000000000002,"n computed",{"$f":"0.255*(1+0.83^N9)","v":0.38377350574709118},{"$f":"IF(V9>0,V9,0.255*(1+0.83^N9))","v":0.38377350574709118},null,null,null,null,null,null,null,null,null,1.6454515405018406,100.72261789220805,null,0,"Kozeny-Carmen"," "," "," ",null,"Kozeny-Carmen",0.10326466562081722,1.0326466562081721E-3,89.220671096386084,null,26.957224663601917,22.145764270745261]
[-1.2505486303822491,0.42,20,0.2,40,null,null,null,null,null,"d20",0.28000000000000003,"g (cm/s2)",980,null,null,null,null,null,null,null,null,null,null,1.6101598632345404,100.44118741751555,null,1,"Zunker",5.6403675932494818E-2,5.6403675932494815E-4,48.732776005675518,null,"Zunker"," "," "," ",null,26.957224663601917,22.145764270745261]
[-1.8350483465657719,0.28000000000000003,20,0.2,20,null,null,null,null,null,"d50",0.48499999999999999,"r (g/cm3)",0.99813600000000002,null,null,null,null,null,null,null,null,null,null,1.5756251225610456,100.10733113332977,null,1,"Zamarin",6.6457521399872599E-2,6.6457521399872601E-4,57.419298489489933,null,"Zamarin"," "," "," ",null,26.957224663601917,22.145764270745261]
[-2.7348002838164773,0.15,10,0.1,10,null,null,null,null,null,"d60",0.55000000000000004,"m (g/cm s)",9.8479999999999991E-3,null,null,null,null,null,null,null,null,null,null,1.5418310836902833,99.725466332704173,null,1,"USBR",2.5513642444225246E-2,2.5513642444225244E-4,22.043787071810613,null,"USBR"," "," "," ",null,26.957224663601917,22.145764270745261]
[-4.470391703025502,4.4999999999999998E-2,10,0.1,0,null,null,null,null,null,"dgeometric mean",0.44970904468378892,"rg/m (1/cm s)",99327.099918765234,null,null,null,null,null,null,null,null,null,null,1.5087618600353019,99.299724697511039,null,1,"Barr",1.3372744950630731E-2,1.337274495063073E-4,11.55405163734495,null,"Barr"," "," "," ",null,26.957224663601917,22.145764270745261]
[" ",null,null,null,null,null,null,null,null,null,"de (Kruger)",0.34383499566902992,"tau (Sauerbrei)",1.0530200000000001,null,null,null,null,null,null,null,null,null,null,1.4764019057449811,98.833969743997841,null,1,"Alyamani and Sen",8.3791178385416651E-3,8.3791178385416652E-5,7.2395578124999993,null,"Alyamani and Sen"," "," "," ",null,26.957224663601917,22.145764270745261]
[" ",null,null,null,null,null,null,null,null,null,"de (Kozeny)",0.29008871223808247,"d5f",-3.3584655152414449,null,null,null,null,null,null,null,null,null,null,1.4447360083959242,98.331813211027097,null,0,"Chapuis"," "," "," ",null,"Chapuis",1.7386448385766098E-2,1.73864483857661E-4,15.021891405301911,null,26.957224663601917,22.145764270745261]
[" ",null,null,null,null,null,null,null,null,null,"de (Zunker)",0.30734018950367153,"d16f",-2.1329016020949574,null,null,null,null,null,null,null,null,null,null,1.4137492818410928,97.796630455436159,null,1,"Krumbein and Monk",3.218278355174381E-2,{"$f":"IF($AB17>0,$AB17*I33,\" \")","v":3.2182783551743812E-4},27.805924988706654,null,"Krumbein and Monk",{"$f":"IF($AB17=0,H33,\" \")","v":" "}," "," ",null,26.957224663601917,22.145764270745261]
[" ",null,null,null,null,null,"Estimation of Hydraulic Conductivity","cm/s","m/s","m/d","de (Zamarin)",0.32596413045467088,"d50f",{"$f":"3.3193*LOG(L12)","v":-1.0431174470575064},null,null,null,null,null,null,null,null,null,null,1.3834271592118257,97.231574914996159,null,1,"Shepherd",5.0082769150900264E-2,5.0082769150900264E-4,43.271512546377828,null,"Shepherd"," "," "," ",null,26.957224663601917,22.145764270745261]
[" ",null,null,null,null,null,"Hazen",3.0006144042093508E-2,{"$f":"H19/100","v":3.0006144042093509E-4},{"$f":"H19/100*24*60*60","v":25.925308452368792},"Io (Alyameni)",{"$f":"IF(L9-10*(L12-L9)/40<0,0,L9-10*(L12-L9)/40)","v":6.6250000000000003E-2},"d84f",7.8610104909327475E-2,null,null,null,null,null,null,null,null,null,null,1.3537553860699494,96.639591695734921,null,null,"geometric mean",{"$f":"GEOMEAN(AD3:AD18)","v":2.5631671609658867E-2},2.5631671609658869E-4,{"$f":"GEOMEAN(AF3:AF18)","v":22.145764270745261}]
[" ",null,null,null,null,"ü","Hazen K (cm/s) = d102 (mm2)",{"$f":"L9^2","v":2.2499999999999999E-2},{"$f":"H20/100","v":2.2499999999999999E-4},{"$f":"H20/100*24*60*60","v":19.440000000000001},null,null,"d95f",0.76977438525807729,null,null,null,null,null,null,null,null,null,null,1.3247200137067627,96.023430336905548,null,null,"arithmetic mean",{"$f":"AVERAGE(AD3:AD18)","v":3.1200491508798514E-2},3.1200491508798521E-4,{"$f":"AVERAGE(AF3:AF18)","v":26.957224663601917}]
[{"$f":"IF(ISBLANK(B21),\" \",3.3193*LOG(B21))","v":" "},null,null,null,null,"ü","Slichter",9.5963209315535949E-3,9.5963209315535949E-5,{"$f":"H21/100*24*60*60","v":8.2912212848623064},null,null,"sf",{"$f":"(N19-N17)/4+(N20-N16)/6.6","v":1.1783688207661502},null,null,null,null,null,null,null,null,null,null,1.2963073925857458,95.385656803613529]
[" ",null,null,null,null,null,"Terzaghi",1.6695337658127831E-2,1.669533765812783E-4,{"$f":"H22/100*24*60*60","v":14.424771736622445},null,"mm",null,"% in sample",null,null,null,null,null,null,null,null,null,null,1.2685041659259082,94.728664754048879]
[" ",null,null,null,null,"ü","Beyer",2.4807909969877112E-2,2.4807909969877111E-4,21.43403421397382,null,">64","Boulder",null,null,null,null,null,null,null,null,null,null,null,1.2412972634227635,94.054686125392692]
[" ",null,null,null,null,"ü","Sauerbrei",3.3908920426943837E-2,3.3908920426943838E-4,29.297307248879473,null,"16 - 64","coarse gravel",null,null,null,null,null,null,null,null,null,null,null,1.2146738951039746,93.365801079768104]
[" ",null,null,null,null,null,"Kruger",5.162397278775268E-2,5.1623972787752685E-4,44.603112488618315,null,"8 - 16","medium gravel",null,null,null,null,null,null,null,null,null,null,null,1.188621545316785,92.663947349072913]
[" ",null,null,null,null,null,"Kozeny-Carmen",0.10326466562081722,1.0326466562081721E-3,89.220671096386084,null,"2  - 8","fine gravel",0,null,null,null,null,null,null,null,null,null,null,1.1631279668444066,91.950929015154387]
[" ",null,null,null,null,"ü","Zunker",5.6403675932494818E-2,5.6403675932494815E-4,48.732776005675518,null,"0.5 - 2","coarse sand",40,null,null,null,null,null,null,null,null,null,null,1.1381811751485997,91.228424759557043]
[" ",null,null,null,null,"ü","Zamarin",6.6457521399872599E-2,6.6457521399872601E-4,57.419298489489933,null,"0.25 - 0.5","medium sand",40,null,null,null,null,null,null,null,null,null,null,1.1137694427357387,90.49799561498169]
[" ",null,null,null,null,"ü","USBR",2.5513642444225246E-2,2.5513642444225244E-4,22.043787071810613,null,"0.063 - 0.25","fine sand",10,null,null,null,null,null,null,null,null,null,null,1.0898812936437134,89.761092248630135]
[" ",null,null,null,null,"ü","Barr",1.3372744950630731E-2,1.337274495063073E-4,11.55405163734495,null,"0.016 - 0.063","coarse silt",10,null,null,null,null,null,null,null,null,null,null,1.0665054980470769,89.019061805768018]
{"$rows_left_out":147}
{"sheet":"Examples","index":2,"n_rows":47,"n_cols":24,"rows_kept":47,"cut":false,"hidden":false,"merged":[]}
["Examples  of Grain Retention Datasets from the literature"]
[]
["Example 1 Case 1 Vukovic 15 oC",null,null,null,null,null,"Sample 1 Odong 20 oC",null,null,null,null,null,"Thomson SERDP Borden sand",null,null,null,null,null,null,"Sample 1 Alyamani and Sen"]
["ps",null,null,"pp",null,null,"ps",null,null,"pp",null,null,"ps",null,null,"pp",null,null,null,"ps",null,null,"pp"]
[2,null,null,100,null,null,10,null,null,85.23,null,null,10,null,null,99.99,null,null,null,3.7,null,null,95]
[0.82,null,null,80,null,null,4.75,null,null,79.569999999999993,null,null,9,null,null,99.9,null,null,null,2.82,null,null,90]
[0.55000000000000004,null,null,60,null,null,2.36,null,null,66.73,null,null,3,null,null,99.8,null,null,null,2,null,null,85]
[0.42,null,null,40,null,null,1.18,null,null,49.99,null,null,1.3,null,null,98,null,null,null,1.81,null,null,80]
[0.28000000000000003,null,null,20,null,null,0.6,null,null,30.75,null,null,0.8,null,null,97,null,null,null,1.7,null,null,75]
[0.15,null,null,10,null,null,0.42499999999999999,null,null,17.55,null,null,0.4,null,null,95,null,null,null,1.52,null,null,70]
[4.4999999999999998E-2,null,null,0,null,null,0.3,null,null,6.28,null,null,0.23,null,null,82,null,null,null,1.48,null,null,65]
[null,null,null,null,null,null,0.15,null,null,2.84,null,null,0.15,null,null,31,null,null,null,1.31,null,null,60]
["Example 1 Case 2 Vukovic 15 oC",null,null,null,null,null,7.4999999999999997E-2,null,null,0,null,null,7.0000000000000007E-2,null,null,10,null,null,null,1.1200000000000001,null,null,55]
["ps",null,null,"pp",null,null,null,null,null,null,null,null,0.04,null,null,2.6,null,null,null,0.95,null,null,50]
[2,null,null,100,null,null,null,null,null,null,null,null,2.7E-2,null,null,2.6,null,null,null,0.92,null,null,45]
[1.5,null,null,95,null,null,"Sample 2 Odong 20 oC",null,null,null,null,null,1.7000000000000001E-2,null,null,2.6,null,null,null,0.86,null,null,40]
[1.2,null,null,90,null,null,"ps",null,null,"pp",null,null,0.01,null,null,2.5,null,null,null,0.8,null,null,35]
[0.95,null,null,85,null,null,1.18,null,null,100,null,null,5.4999999999999997E-3,null,null,1,null,null,null,0.75,null,null,30]
[0.82,null,null,80,null,null,0.6,null,null,96.2,null,null,2E-3,null,null,0,null,null,null,0.61,null,null,25]
[0.73,null,null,75,null,null,0.42499999999999999,null,null,77.650000000000006,null,null,null,null,null,null,null,null,null,0.55000000000000004,null,null,20]
[0.66,null,null,70,null,null,0.3,null,null,48.41,null,null,"Schillig PVP4-5, elev 289.5 masl",null,null,null,null,null,null,0.5,null,null,15]
[0.6,null,null,65,null,null,0.21199999999999999,null,null,18.88,null,null,10,0,"total weight",110.69,null,null,null,0.4,null,null,10]
[0.55000000000000004,null,null,60,null,null,0.15,null,null,2.2999999999999998,null,null,9,0,"tracer test derived Ks: 1.9e-3 m/s to 1.4e-2 m/s",null,null,null,null,0.3,null,null,5]
[0.51,null,null,55,null,null,7.4999999999999997E-2,null,null,0,null,null,4,64.33,null,"=","164 m/d to 1210 m/d"]
[0.48,null,null,50,null,null,null,null,null,null,null,null,2,12.89,null,null,null,null,null,"Paul Van Horne <Paul.VanHorne@shanwil.com>"]
[0.45,null,null,45,null,null,"Sample 3 Odong 20 oC",null,null,null,null,null,1,11.81,null,null,null,null,null,"ps",null,null,"pp","total mass: 417.54 g"]
[0.42,null,null,40,null,null,"ps",null,null,"pp",null,null,0.5,7.51,null,null,null,null,null,38.1,null,null,100]
[0.39,null,null,35,null,null,4.75,null,null,95.05,null,null,0.29699999999999999,3.56,null,null,null,null,null,25.4,null,null,91.028400000000005]
[0.36,null,null,30,null,null,2.36,null,null,85.08,null,null,0.17699999999999999,2.38,null,null,null,null,null,19,null,null,88.920820000000006]
[0.32,null,null,25,null,null,2,null,null,82.02,null,null,0.125,2.97,null,null,null,null,null,12.5,null,null,77.805719999999994]
{"$rows_left_out":18}
{"sheet":"Equations","index":3,"n_rows":12,"n_cols":14,"rows_kept":12,"cut":false,"hidden":false,"merged":[]}
[]
[]
[]
[]
[]
[null,null,null,null,20]
[]
[]
[]
[]
[null,null,null,null,null,null,null,null,null,null,null,null,null,980]
[null,null,null,null,null,null,null,null,null,null,null,null,null,0.99813600000000002]

{"sheet":"References","index":4,"n_rows":27,"n_cols":2,"rows_kept":27,"cut":false,"hidden":false,"merged":[]}
[null,"References"]
[1,"Aguilar, J.R. 2013. Analysis of grain size distribution and hydraulic conductivity for a variety of sediment types with application to wadi sediments.  M.B2:B19S. thesis submitted to King Abdullah University of Science and Technology, Thuwal, Kingdom of Saudi Arabia, 134 pp."]
[{"$f":"A2+1","v":2},"Alyamani, M.S., Sen Z.  1993.  Determination of hydraulic conductivity from complete grain-size distribution curves.  Ground Water, v. 31, no. 4, 551-555."]
[{"$f":"A3+1","v":3},"Barr, D.W.  2001.  Coefficient of permeability determined by measurable parameters.  Ground Water, v. 39, no. 3, 356-361."]
[4,"Barth, G.R., Hill, M.C., Illangasekare, T.H., Rajaram, H.  2001.  Predictive modeling of flow and transport in a two-dimensional intermediate-scale, heterogeneous porous medium.  Water Resources Research, v. 37, no. 10, 2503–2512."]
[5,"Beyer, W. 1964. \"Zur Bestimmung der Wasserdurchlässigkeit von Kiesen und Sanden aus der Kornverteilungskurve.\" Wasserwirtschaft-Wassertechnik 14(6): 165-168."]
[6,"Białas, Z. (1966). O usrednianiu wspolczynnikow filtracji z zastosowaniem elektronicznej cyfrowej maszyny matematycznej (Averaging filter coefficients using digital electronic mathematical machines). Przedsiebiorstwo Geologiczne we Wroclawiu: 47-50."]
[7,"Chapuis, R.P.  2004.  Predicting the saturated hydraulic conductivity of sand and gravel using effective diameter and void ratio.  Canadian Geotechnical Journal, v. 41, 787–795."]
[8,"Devlin, J.F. (2015). HydrogeoSieveXL.  Excel-based Visual Basic tool freely available at http://www.people.ku.edu/~jfdevlin/Publications.html.   Cited 18 February, 2015."]
[9,"Dullien, F.A., 1991. Fluid Transport and Pore Structure. Academic Press, San Diego, CA."]
[10,"Freeze, R.A., Cherry, J.A.  1979. Groundwater. Prentice Hall, Englewood Cliffs, New Jersey."]
[11,"Fuchs, S. (2010) Deterministische kf-Wert-Schätzung nach petrographischer Bohrgutansprache (Deterministic kf value estimation from petrographic borehole records).  Grundwasser – Zeitschrift der Fachsektion Hydrogeologie 15: 177–189."]
[12,"Hazen, A. 1892.  Some physical properties of sands and gravels, with special reference to their use in  filtration. Massachusetts State Board of Health, vol. 24th annual report, pp. 539-556."]
[13,"Kasenow, M., 2002, Determination of Hydraulic Conductivity from Grain Size Analysis: Water Resources Publications, LLC, Highlands Ranch, Colorado, 97p."]
[14,"Kozeny, J. (1953).  Das Wasser im Boden. Grundwasserbewegung (The water in the ground.\nGroundwater flow).  Hydraulik, Springer, p 380-445."]
[15,"Krüger, E., 1919. Die Grundwasserbewegung (Groundwater flow). Int. Mitt. Bodenk. 8, 105–122."]
[16,"Krumbein, W.C., Monk, G.D.  1942.  Permeability as a function of the size parameters of unconsolidated sand.  American Institute of Mining and Metallurgical Engineers, Transactions v. 151, 153-163."]
[17,"Moreau, J.P. Program to demonstrate the Akima spline fitting of Function SIN(X) in double precision.  http://jean-pierre.moreau.pagesperso-orange.fr/Fortran/akima_f90.txt .  Cited 30 January, 2015."]
[18,"Odong, J.  2013.  Evaluation of empirical formulae for determination of hydraulic conductivity based on grain-size analysis.  International Journal of Agriculture and Environment, v. 1, 1-8."]
[19,"Rosas, J., Lopez, O., Missimer, T.M., Coulibaly, K.M., Dehwah, A.H.A., Sesler, K., Lujan, L.R., Mantilla, D.  2014.  Determination of hydraulic conductivity from grain-size distribution for different depositional environments.  Groundwater, v. 52, no. 3, 399-413."]
[{"$f":"A20+1","v":20},"Shepherd, R.G.  1989.  Correlations of permeability and grain size.  Ground Water, 27(5): 633-638."]
[21,"Slichter, C.S., 1898, Theoretical investigations of the motion of ground waters: United States Geological Survey, 19 th Annual Report, p 295-384."]
[22,"Terzaghi, K., 1925, Principles of soil mechanics: Engineering News-Record, v. 95, p 832."]
[23,"Urumovic, K., Urumovic, K. Sr.  2106.  The referential grain size and effective porosity in the Kozeny–Carman model.  Hydrological Earth System Science, v. 20, 1669-1680."]
[24,"Vukovic, M., Soro, A.  1992.  Determinatiion of hydraulic conductivity of porous media from grain-size composition.  Miladinov, D., translator, Water Resources Publications, Littleton, Colorado, USA, 83 pp."]
[25,"Zamarin, J.A.  1928.  Calculation of ground-water flow (in Russian).  Trudey I.V.H. Taskeni."]
[26,"Zunker, F. (1930). Das Verhalten des Wassers zum Boden (The behavior of groundwater).  Zeitschrift für Pflanzenernährung, Düngung und Bodenkunde. A25(1): 7."]

{"sheet":" Report Grain Size","index":5,"n_rows":43,"n_cols":9,"rows_kept":43,"cut":false,"hidden":false,"merged":[[19,5,19,6],[19,7,19,8],[6,0,6,8],[41,5,41,6],[30,5,30,6],[31,5,31,6],[32,5,32,6],[33,5,33,6],[34,5,34,6],[35,5,35,6],[36,5,36,6],[37,5,37,6],[38,5,38,6],[39,5,39,6],[40,5,40,6]]}
[]
[null,null,"Grain Size Analysis Report",null,null,null,"Date:"]
[]
[null,null,"Sample Name:"]
[null,null,null,{"$f":"Input!C5","v":"Mass Sample (g):"},null,{"$f":"Input!C6","v":100},null,{"$f":"Input!E5","v":"T (oC)"},{"$f":"Input!E6","v":20}]
[]
[{"$f":"Input!K2","v":" Moderately well sorted  sand low in fines "}]
[]
[]
[]
[]
[]
[]
[]
[]
[]
[]
[]
[]
[{"$f":"Input!B7","v":"Sieve opening (ps)              di (mm)"},{"$f":"Input!C7","v":"Mass of retained (mr) \n(g)"},{"$f":"Input!D7","v":"mass fraction (mf)"},{"$f":"Input!E7","v":"Percent Passing (pp)"},null,{"$f":"Input!K8","v":"Effective Grain Diameters (mm)"},null,{"$f":"Input!M8","v":"Other Useful Parameters"}]
[{"$f":"IF(ISBLANK(Input!B8),\" \",Input!B8)","v":2},{"$f":"IF(ISBLANK(Input!C8),\" \",Input!C8)","v":0},{"$f":"IF(ISBLANK(Input!D8),\" \",Input!D8)","v":0},{"$f":"IF(ISBLANK(Input!E8),\" \",Input!E8)","v":100},null,{"$f":"Input!K9","v":"d10"},{"$f":"Input!L9","v":0.15},"Uniformity Coef.",{"$f":"Input!N9","v":3.666666666666667}]
[{"$f":"IF(ISBLANK(Input!B9),\" \",Input!B9)","v":0.82},{"$f":"IF(ISBLANK(Input!C9),\" \",Input!C9)","v":20},{"$f":"IF(ISBLANK(Input!D9),\" \",Input!D9)","v":0.2},{"$f":"IF(ISBLANK(Input!E9),\" \",Input!E9)","v":80},null,{"$f":"Input!K10","v":"d17"},{"$f":"Input!L10","v":0.24100000000000002},"n computed",{"$f":"Input!N10","v":0.38377350574709118}]
[{"$f":"IF(ISBLANK(Input!B10),\" \",Input!B10)","v":0.55000000000000004},{"$f":"IF(ISBLANK(Input!C10),\" \",Input!C10)","v":20},{"$f":"IF(ISBLANK(Input!D10),\" \",Input!D10)","v":0.2},{"$f":"IF(ISBLANK(Input!E10),\" \",Input!E10)","v":60},null,{"$f":"Input!K11","v":"d20"},{"$f":"Input!L11","v":0.28000000000000003},"g (cm/s2)",{"$f":"Input!N11","v":980}]
[{"$f":"IF(ISBLANK(Input!B11),\" \",Input!B11)","v":0.42},{"$f":"IF(ISBLANK(Input!C11),\" \",Input!C11)","v":20},{"$f":"IF(ISBLANK(Input!D11),\" \",Input!D11)","v":0.2},{"$f":"IF(ISBLANK(Input!E11),\" \",Input!E11)","v":40},null,{"$f":"Input!K12","v":"d50"},{"$f":"Input!L12","v":0.48499999999999999},"r (g/cm3)",{"$f":"Input!N12","v":0.99813600000000002}]
[{"$f":"IF(ISBLANK(Input!B12),\" \",Input!B12)","v":0.28000000000000003},{"$f":"IF(ISBLANK(Input!C12),\" \",Input!C12)","v":20},{"$f":"IF(ISBLANK(Input!D12),\" \",Input!D12)","v":0.2},{"$f":"IF(ISBLANK(Input!E12),\" \",Input!E12)","v":20},null,{"$f":"Input!K13","v":"d60"},{"$f":"Input!L13","v":0.55000000000000004},"m (g/cm s)",{"$f":"Input!N13","v":9.8479999999999991E-3}]
[{"$f":"IF(ISBLANK(Input!B13),\" \",Input!B13)","v":0.15},{"$f":"IF(ISBLANK(Input!C13),\" \",Input!C13)","v":10},{"$f":"IF(ISBLANK(Input!D13),\" \",Input!D13)","v":0.1},{"$f":"IF(ISBLANK(Input!E13),\" \",Input!E13)","v":10},null,{"$f":"Input!K15","v":"de (Kruger)"},{"$f":"Input!L15","v":0.34383499566902992},"rg/m (1/cm s)",{"$f":"Input!N14","v":99327.099918765234}]
[{"$f":"IF(ISBLANK(Input!B14),\" \",Input!B14)","v":4.4999999999999998E-2},{"$f":"IF(ISBLANK(Input!C14),\" \",Input!C14)","v":10},{"$f":"IF(ISBLANK(Input!D14),\" \",Input!D14)","v":0.1},{"$f":"IF(ISBLANK(Input!E14),\" \",Input!E14)","v":0},null,{"$f":"Input!K16","v":"de (Kozeny)"},{"$f":"Input!L16","v":0.29008871223808247},"tau (Sauerbrei)",{"$f":"Input!N15","v":1.0530200000000001}]
[{"$f":"IF(ISBLANK(Input!B15),\" \",Input!B15)","v":" "},{"$f":"IF(ISBLANK(Input!C15),\" \",Input!C15)","v":" "},{"$f":"IF(ISBLANK(Input!D15),\" \",Input!D15)","v":" "},{"$f":"IF(ISBLANK(Input!E15),\" \",Input!E15)","v":" "},null,{"$f":"Input!K17","v":"de (Zunker)"},{"$f":"Input!L17","v":0.30734018950367153},"dgeometric mean",{"$f":"Input!L14","v":0.44970904468378892}]
[{"$f":"IF(ISBLANK(Input!B16),\" \",Input!B16)","v":" "},{"$f":"IF(ISBLANK(Input!C16),\" \",Input!C16)","v":" "},{"$f":"IF(ISBLANK(Input!D16),\" \",Input!D16)","v":" "},{"$f":"IF(ISBLANK(Input!E16),\" \",Input!E16)","v":" "},null,{"$f":"Input!K18","v":"de (Zamarin)"},{"$f":"Input!L18","v":0.32596413045467088},"sf",{"$f":"Input!N21","v":1.1783688207661502}]
[{"$f":"IF(ISBLANK(Input!B17),\" \",Input!B17)","v":" "},{"$f":"IF(ISBLANK(Input!C17),\" \",Input!C17)","v":" "},{"$f":"IF(ISBLANK(Input!D17),\" \",Input!D17)","v":" "},{"$f":"IF(ISBLANK(Input!E17),\" \",Input!E17)","v":" "},null,{"$f":"Input!K19","v":"Io (Alyameni)"},{"$f":"Input!L19","v":6.6250000000000003E-2}]
{"$rows_left_out":14}
{"sheet":"Report K","index":6,"n_rows":45,"n_cols":7,"rows_kept":45,"cut":false,"hidden":false,"merged":[[7,0,7,7]]}
[]
[null,null,"K from Grain Size Analysis Report",null,null,"Date:"]
[]
[null,null,"Sample Name:"]
[]
[null,null,{"$f":"Input!C5","v":"Mass Sample (g):"},{"$f":"Input!C6","v":100},null,{"$f":"Input!E5","v":"T (oC)"},{"$f":"Input!E6","v":20}]
[]
[{"$f":"Input!K2","v":" Moderately well sorted  sand low in fines "}]
[]
[]
[]
[]
[]
[]
[]
[]
[]
[]
[]
[]
[]
[]
[]
[]
[]
[]
[null,null,{"$f":"Input!G$18","v":"Estimation of Hydraulic Conductivity"},{"$f":"Input!H$18","v":"cm/s"},{"$f":"Input!I$18","v":"m/s"},{"$f":"Input!J$18","v":"m/d"},"de"]
[null,null,"Hazen",{"$f":"IF(ISBLANK(Input!H19),\" \",Input!H19)","v":3.0006144042093508E-2},{"$f":"IF(ISBLANK(Input!I19),\" \",Input!I19)","v":3.0006144042093509E-4},{"$f":"IF(ISBLANK(Input!J19),\" \",Input!J19)","v":25.925308452368792}]
[null,null,"Hazen K (cm/s) = d10 (mm)",{"$f":"IF(ISBLANK(Input!H20),\" \",Input!H20)","v":2.2499999999999999E-2},{"$f":"IF(ISBLANK(Input!I20),\" \",Input!I20)","v":2.2499999999999999E-4},{"$f":"IF(ISBLANK(Input!J20),\" \",Input!J20)","v":19.440000000000001}]
[null,null,"Slichter",{"$f":"IF(ISBLANK(Input!H21),\" \",Input!H21)","v":9.5963209315535949E-3},{"$f":"IF(ISBLANK(Input!I21),\" \",Input!I21)","v":9.5963209315535949E-5},{"$f":"IF(ISBLANK(Input!J21),\" \",Input!J21)","v":8.2912212848623064}]
{"$rows_left_out":15}